program: Orca
programVersion: 5.0.2
elementType: S S S P P O O O O O O C C C C C C C C C C C C C C C C H H H H H H H H H H H H H H H H H H H H
charge: 0
multiplicity: 1
keywords: wb97x-d3
keywords: def2-TZVPP
keywords: def2/J RIJCOSX
keywords: DEFGRID2
keywords: scfconv7
keywords: smallprint printgap noloewdin
keywords: NOSOSCF
formula: C16H20O6P2S3
InChI: InChI=1/C16H20O6P2S3/c1-17-23(25,18-2)21-13-5-9-15(10-6-13)27-16-11-7-14(8-12-16)22-24(26,19-3)20-4/h5-12H,1-4H3
47 atoms
S  -0.006365 -3.029076 -0.084178
S  -5.376769 1.072025 -1.821263
S  5.196642 1.215882 1.783511
P  -5.881284 0.812314 0.007985
P  5.853687 0.830565 0.026444
O  -4.701606 0.391419 1.030606
O  4.767042 0.320792 -1.05718
O  -6.949306 -0.321662 0.332834
O  -6.498371 2.063842 0.774717
O  6.530785 2.033531 -0.767459
O  6.95354 -0.310578 -0.127558
C  -1.367469 -1.93744 0.205625
C  1.37775 -1.954869 -0.323568
C  -3.620935 -0.397699 0.717585
C  3.662291 -0.444363 -0.768989
C  -2.613584 -2.33039 -0.270864
C  1.309986 -0.790738 -1.084947
C  -1.261456 -0.76807 0.953871
C  2.600926 -2.355801 0.202668
C  -3.744953 -1.57429 -0.003734
C  2.445226 -0.024731 -1.286745
C  -2.381629 0.010892 1.18957
C  3.748953 -1.613658 -0.031193
C  -8.141483 -0.460087 -0.447954
C  -5.951443 3.376419 0.603129
C  5.994439 3.359329 -0.699066
C  8.091357 -0.346603 0.741487
H  -2.715301 -3.233605 -0.859185
H  0.372345 -0.46812 -1.51877
H  -0.306631 -0.451092 1.352797
H  2.670474 -3.254587 0.802141
H  -4.705597 -1.918358 -0.363383
H  2.388311 0.888674 -1.865007
H  -2.293577 0.928919 1.756618
H  4.694176 -1.960973 0.365003
H  -8.692886 -1.294847 -0.022708
H  -7.904091 -0.678588 -1.489072
H  -8.757904 0.43763 -0.394659
H  -4.922234 3.426072 0.960096
H  -5.988012 3.683822 -0.442097
H  -6.566469 4.048964 1.195396
H  6.644585 3.987332 -1.30271
H  4.982797 3.399358 -1.104142
H  5.989284 3.728318 0.326497
H  7.78669 -0.469328 1.781022
H  8.685554 -1.204958 0.438704
H  8.694554 0.556472 0.643233
elementType: S P O C H
totalener: -2950.73609473 hartree
nucrepener: 3245.95449882 hartree
electener: -6196.69059355 hartree
twoeener: 4326.83748869 hartree
cpcmener: -0.03115392 hartree
kineticenergy: 2942.53454923 hartree
xcener: -192.747906408015 hartree
chargesum: -0.0000000
charge: -0.022610 -0.443446 -0.443856 0.754838 0.756308 -0.328299 -0.330861 -0.336679 -0.339637 -0.340217 -0.337745 0.050139 0.052096 0.219815 0.215505 -0.158917 -0.170666 -0.169034 -0.156647 -0.151328 -0.165687 -0.169399 -0.150381 -0.117443 -0.117376 -0.117045 -0.117755 0.134737 0.156655 0.155702 0.135273 0.140190 0.149441 0.149295 0.144460 0.129607 0.112085 0.127838 0.125932 0.110804 0.129005 0.128808 0.125804 0.111853 0.112265 0.129589 0.126982
qa: -0.0226 -0.4434 -0.4439 0.7548 0.7563 -0.3283 -0.3309 -0.3367 -0.3396 -0.3402 -0.3377 0.0501 0.0521 0.2198 0.2155 -0.1589 -0.1707 -0.1690 -0.1566 -0.1513 -0.1657 -0.1694 -0.1504 -0.1174 -0.1174 -0.1170 -0.1178 0.1347 0.1567 0.1557 0.1353 0.1402 0.1494 0.1493 0.1445 0.1296 0.1121 0.1278 0.1259 0.1108 0.1290 0.1288 0.1258 0.1119 0.1123 0.1296 0.1270
va: 2.4063 1.9887 1.9885 5.4894 5.4855 2.1317 2.1268 2.0943 2.1064 2.1040 2.0973 3.7796 3.7680 3.7735 3.7700 3.9979 3.9477 3.9443 4.0024 3.9609 3.9880 3.9854 3.9683 3.8409 3.8463 3.8453 3.8418 1.0142 0.9883 0.9889 1.0145 1.0137 1.0009 1.0016 1.0116 0.9904 0.9992 0.9890 0.9852 1.0004 0.9909 0.9913 0.9849 1.0004 0.9994 0.9904 0.9893
dispcorr: -0.022796580 hartree
energy: -2950.758891306748
dipole: 0.20671 -0.12714 0.07957 7.95416 -6.81675 1.13742 0.33740 -0.28643 0.05097
magnitude: 1.14134 au
magnitude: 2.90104 debye
