program: Orca
programVersion: 5.0.2
elementType: S S S P P O O O O O O C C C C C C C C C C C C C C C C H H H H H H H H H H H H H H H H H H H H
charge: 0
multiplicity: 1
keywords: wb97x-d3
keywords: def2-TZVPP
keywords: def2/J RIJCOSX
keywords: DEFGRID2
keywords: scfconv7
keywords: smallprint printgap noloewdin
keywords: NOSOSCF
formula: C16H20O6P2S3
InChI: InChI=1/C16H20O6P2S3/c1-17-23(25,18-2)21-13-5-9-15(10-6-13)27-16-11-7-14(8-12-16)22-24(26,19-3)20-4/h5-12H,1-4H3
47 atoms
S  -0.001914 -3.167242 1.064961
S  -3.922624 2.3075 -0.322415
S  6.476312 -0.589993 0.357383
P  -5.361921 1.104962 0.069557
P  5.476994 0.846097 -0.423286
O  -5.096065 -0.461747 -0.232168
O  4.103382 0.448151 -1.175209
O  -6.727947 1.320483 -0.715416
O  -5.859951 1.023591 1.5787
O  4.951845 1.985426 0.555238
O  6.190868 1.689267 -1.567992
C  -1.50522 -2.321061 0.665222
C  1.212866 -2.061465 0.403633
C  -3.897959 -1.066359 0.080889
C  3.169339 -0.393187 -0.611616
C  -2.486873 -2.201322 1.641278
C  2.252624 -2.58644 -0.354331
C  -1.738226 -1.822883 -0.614558
C  1.167191 -0.693728 0.661249
C  -3.693032 -1.579543 1.349432
C  3.243197 -1.753428 -0.853954
C  -2.927247 -1.178016 -0.903105
C  2.139441 0.145084 0.145532
C  -6.750319 1.632816 -2.111384
C  -6.092831 2.208435 2.349021
C  5.796491 2.548086 1.566012
C  6.935697 1.051613 -2.610484
H  -2.314149 -2.580799 2.640205
H  2.292551 -3.646826 -0.567585
H  -0.988217 -1.922565 -1.388593
H  0.36799 -0.273197 1.257657
H  -4.458153 -1.495273 2.110292
H  4.048148 -2.160797 -1.451027
H  -3.107385 -0.780627 -1.893533
H  2.090599 1.21084 0.327581
H  -6.159817 2.523362 -2.325865
H  -7.788722 1.821432 -2.370659
H  -6.378591 0.798491 -2.706351
H  -6.342899 1.880941 3.354579
H  -5.201837 2.835121 2.388075
H  -6.924788 2.783298 1.942736
H  6.604911 3.128168 1.121396
H  5.171328 3.206711 2.163124
H  6.215193 1.772136 2.206712
H  7.715547 0.408989 -2.20184
H  6.282988 0.464313 -3.256649
H  7.394535 1.844807 -3.19466
elementType: S P O C H
totalener: -2950.73695365 hartree
nucrepener: 3288.57363393 hartree
electener: -6239.31058757 hartree
twoeener: 4369.77843311 hartree
cpcmener: -0.03009023 hartree
kineticenergy: 2942.58564053 hartree
xcener: -192.752476144270 hartree
chargesum: -0.0000000
charge: -0.048172 -0.448415 -0.449104 0.765352 0.764733 -0.352801 -0.352334 -0.336362 -0.336266 -0.336613 -0.335623 0.030067 0.027176 0.247197 0.254623 -0.144983 -0.133041 -0.125081 -0.135975 -0.169186 -0.186898 -0.192946 -0.178307 -0.113049 -0.116290 -0.114646 -0.112954 0.135421 0.136212 0.151043 0.151546 0.152899 0.146633 0.148871 0.152122 0.109315 0.128930 0.126345 0.127190 0.110383 0.126011 0.125929 0.126576 0.110224 0.109306 0.125640 0.129302
qa: -0.0482 -0.4484 -0.4491 0.7654 0.7647 -0.3528 -0.3523 -0.3364 -0.3363 -0.3366 -0.3356 0.0301 0.0272 0.2472 0.2546 -0.1450 -0.1330 -0.1251 -0.1360 -0.1692 -0.1869 -0.1929 -0.1783 -0.1130 -0.1163 -0.1146 -0.1130 0.1354 0.1362 0.1510 0.1515 0.1529 0.1466 0.1489 0.1521 0.1093 0.1289 0.1263 0.1272 0.1104 0.1260 0.1259 0.1266 0.1102 0.1093 0.1256 0.1293
va: 2.3347 1.9900 1.9926 5.4983 5.5046 2.1031 2.1057 2.1052 2.1190 2.1203 2.1040 3.7364 3.7449 3.7151 3.7128 3.9881 3.9736 3.9069 3.9242 4.0550 4.0393 4.0155 4.0454 3.8414 3.8482 3.8470 3.8402 1.0137 1.0131 0.9909 0.9915 1.0052 1.0055 1.0021 1.0059 1.0018 0.9905 0.9858 0.9899 1.0001 0.9869 0.9866 0.9898 1.0008 1.0014 0.9863 0.9902
dispcorr: -0.023192344 hartree
energy: -2950.760145990501
dipole: -1.84747 0.98946 -0.85801 9.43986 -8.11871 1.32115 -1.73064 1.19904 -0.53160
magnitude: 1.66260 au
magnitude: 4.22599 debye
