program: Orca
programVersion: 5.0.2
elementType: S S S P P O O O O O O C C C C C C C C C C C C C C C C H H H H H H H H H H H H H H H H H H H H
charge: 0
multiplicity: 1
keywords: wb97x-d3
keywords: def2-TZVPP
keywords: def2/J RIJCOSX
keywords: DEFGRID2
keywords: scfconv7
keywords: smallprint printgap noloewdin
keywords: NOSOSCF
formula: C16H20O6P2S3
InChI: InChI=1/C16H20O6P2S3/c1-17-23(25,18-2)21-13-5-9-15(10-6-13)27-16-11-7-14(8-12-16)22-24(26,19-3)20-4/h5-12H,1-4H3
47 atoms
S  -0.004323 -3.075828 -0.205163
S  -5.099338 0.70925 2.923477
S  4.878361 1.272471 -2.709839
P  -5.76105 0.755839 1.126637
P  5.760692 0.859027 -1.061353
O  -4.685325 0.53657 -0.059531
O  4.82778 0.312536 0.140282
O  -6.435746 2.113397 0.643477
O  -6.852638 -0.322615 0.706527
O  6.874561 -0.276826 -1.077572
O  6.520611 2.04506 -0.320669
C  -1.368323 -1.951006 -0.133749
C  1.407243 -2.01339 -0.124265
C  -3.611833 -0.317403 -0.040684
C  3.711998 -0.474175 0.003987
C  -2.522066 -2.373633 0.516587
C  1.500038 -0.966161 0.78933
C  -1.354266 -0.705219 -0.755799
C  2.485521 -2.290723 -0.955399
C  -3.65277 -1.570011 0.550518
C  2.638899 -0.18272 0.835181
C  -2.463827 0.118221 -0.687989
C  3.648393 -1.536822 -0.882625
C  -5.935136 3.384081 1.071733
C  -7.965174 -0.620411 1.557977
C  7.889368 -0.299424 -2.086909
C  5.977646 3.369063 -0.286289
H  -2.552703 -3.338618 1.006682
H  0.680032 -0.743864 1.459834
H  -0.476081 -0.360735 -1.286131
H  2.430136 -3.099844 -1.672549
H  -4.543241 -1.937761 1.042493
H  2.702232 0.644067 1.531196
H  -2.444167 1.094738 -1.15505
H  4.481887 -1.791838 -1.523501
H  -4.895964 3.525651 0.772928
H  -6.020061 3.492886 2.15266
H  -6.550025 4.137417 0.585687
H  -8.618192 0.24514 1.672442
H  -8.517353 -1.422644 1.075382
H  -7.630524 -0.955443 2.539972
H  7.45119 -0.354611 -3.083887
H  8.532583 0.578446 -2.020352
H  8.484259 -1.191309 -1.907838
H  5.870352 3.774621 -1.292201
H  5.011204 3.389796 0.218502
H  6.683647 3.977572 0.272939
elementType: S P O C H
totalener: -2950.73543713 hartree
nucrepener: 3245.36303273 hartree
electener: -6196.09846986 hartree
twoeener: 4326.22041650 hartree
cpcmener: -0.03073917 hartree
kineticenergy: 2942.55685605 hartree
xcener: -192.753322497852 hartree
chargesum: 0.0000000
charge: -0.028237 -0.443737 -0.442544 0.753175 0.754024 -0.321140 -0.324596 -0.341060 -0.336079 -0.337104 -0.339770 0.042273 0.045045 0.235856 0.234130 -0.156455 -0.164443 -0.160610 -0.154286 -0.160385 -0.171191 -0.179157 -0.156363 -0.118049 -0.115906 -0.115527 -0.118237 0.134188 0.156087 0.154724 0.135099 0.135013 0.148993 0.148755 0.137281 0.125141 0.113302 0.129231 0.128105 0.129302 0.110586 0.110440 0.127634 0.128943 0.113054 0.125239 0.129256
qa: -0.0282 -0.4437 -0.4425 0.7532 0.7540 -0.3211 -0.3246 -0.3411 -0.3361 -0.3371 -0.3398 0.0423 0.0450 0.2359 0.2341 -0.1565 -0.1644 -0.1606 -0.1543 -0.1604 -0.1712 -0.1792 -0.1564 -0.1180 -0.1159 -0.1155 -0.1182 0.1342 0.1561 0.1547 0.1351 0.1350 0.1490 0.1488 0.1373 0.1251 0.1133 0.1292 0.1281 0.1293 0.1106 0.1104 0.1276 0.1289 0.1131 0.1252 0.1293
va: 2.3934 1.9880 1.9894 5.4911 5.4907 2.1438 2.1373 2.1041 2.0924 2.0944 2.1058 3.7795 3.7582 3.7657 3.7653 4.0008 3.9464 3.9361 4.0112 3.9621 3.9779 3.9861 3.9608 3.8456 3.8394 3.8402 3.8465 1.0140 0.9882 0.9886 1.0148 1.0183 1.0021 1.0031 1.0168 0.9857 0.9988 0.9915 0.9891 0.9901 1.0006 1.0005 0.9893 0.9902 0.9993 0.9854 0.9912
dispcorr: -0.022712887 hartree
energy: -2950.758150016979
dipole: 0.03149 0.07663 0.10812 7.94011 -6.71132 1.22879 0.46507 -0.39741 0.06766
magnitude: 1.23539 au
magnitude: 3.14012 debye
