program: Orca
programVersion: 5.0.2
elementType: S S S P P O O O O O O C C C C C C C C C C C C C C C C H H H H H H H H H H H H H H H H H H H H
charge: 0
multiplicity: 1
keywords: wb97x-d3
keywords: def2-TZVPP
keywords: def2/J RIJCOSX
keywords: DEFGRID2
keywords: scfconv7
keywords: smallprint printgap noloewdin
keywords: NOSOSCF
formula: C16H20O6P2S3
InChI: InChI=1/C16H20O6P2S3/c1-17-23(25,18-2)21-13-5-9-15(10-6-13)27-16-11-7-14(8-12-16)22-24(26,19-3)20-4/h5-12H,1-4H3
47 atoms
S  0.047177 -3.291648 0.79592
S  -4.071718 2.039769 1.324004
S  6.34044 -0.522501 0.029553
P  -5.359709 1.060293 0.299416
P  5.420844 0.896145 -0.866819
O  -5.168199 -0.545361 0.26678
O  3.840663 1.038963 -0.551971
O  -5.456871 1.372432 -1.258931
O  -6.88741 1.169714 0.736115
O  5.909784 2.383196 -0.579742
O  5.391126 0.873852 -2.457935
C  -1.495377 -2.43249 0.622534
C  1.1899 -1.999366 0.385109
C  -3.937983 -1.154048 0.372828
C  2.999429 -0.00476 -0.255985
C  -2.467313 -2.584461 1.604527
C  2.008288 -2.12978 -0.729246
C  -1.764979 -1.649272 -0.496355
C  1.288748 -0.862728 1.183067
C  -3.692992 -1.945946 1.480201
C  2.919669 -1.134634 -1.054073
C  -2.980705 -0.999976 -0.619401
C  2.190501 0.135969 0.863004
C  -5.536164 2.724925 -1.725034
C  -7.258073 1.099274 2.117908
C  6.333568 2.778841 0.729465
C  6.583527 0.59908 -3.202841
H  -2.267928 -3.183908 2.483497
H  1.932522 -3.004463 -1.361764
H  -1.024668 -1.533656 -1.277562
H  0.661534 -0.753404 2.05843
H  -4.445801 -2.054877 2.250583
H  3.53216 -1.242381 -1.939744
H  -3.181421 -0.393295 -1.493302
H  2.268436 1.021559 1.480645
H  -4.633699 3.280133 -1.469226
H  -6.406951 3.236527 -1.314366
H  -5.631845 2.674495 -2.806555
H  -6.885191 0.188076 2.587017
H  -6.887995 1.966201 2.664744
H  -8.344606 1.092248 2.147231
H  5.560536 2.593149 1.475939
H  7.246684 2.258037 1.016248
H  6.52922 3.846984 0.680825
H  6.952893 -0.404501 -2.991896
H  6.314051 0.668455 -4.253496
H  7.365495 1.327453 -2.98648
elementType: S P O C H
totalener: -2950.73633276 hartree
nucrepener: 3286.72113131 hartree
electener: -6237.45746407 hartree
twoeener: 4367.88757860 hartree
cpcmener: -0.03198460 hartree
kineticenergy: 2942.56733614 hartree
xcener: -192.748560160180 hartree
chargesum: 0.0000000
charge: -0.069688 -0.445001 -0.441865 0.758520 0.754997 -0.342881 -0.330662 -0.337882 -0.339273 -0.339527 -0.338773 0.039760 0.041152 0.219609 0.236692 -0.148624 -0.160720 -0.143032 -0.110073 -0.173215 -0.149907 -0.159071 -0.183943 -0.118727 -0.116896 -0.116153 -0.119412 0.134101 0.135678 0.149083 0.143463 0.150902 0.146909 0.152913 0.149842 0.113172 0.125306 0.129308 0.122556 0.114004 0.129708 0.123577 0.114121 0.129182 0.113710 0.129507 0.127554
qa: -0.0697 -0.4450 -0.4419 0.7585 0.7550 -0.3429 -0.3307 -0.3379 -0.3393 -0.3395 -0.3388 0.0398 0.0412 0.2196 0.2367 -0.1486 -0.1607 -0.1430 -0.1101 -0.1732 -0.1499 -0.1591 -0.1839 -0.1187 -0.1169 -0.1162 -0.1194 0.1341 0.1357 0.1491 0.1435 0.1509 0.1469 0.1529 0.1498 0.1132 0.1253 0.1293 0.1226 0.1140 0.1297 0.1236 0.1141 0.1292 0.1137 0.1295 0.1276
va: 2.2818 1.9870 1.9892 5.4861 5.4861 2.1108 2.1266 2.1040 2.1010 2.1012 2.0940 3.7533 3.7072 3.7308 3.7505 3.9785 4.0157 3.9409 3.9367 4.0283 3.9639 3.9877 4.0051 3.8458 3.8510 3.8466 3.8425 1.0140 1.0153 0.9922 0.9971 0.9958 1.0096 1.0080 1.0000 0.9985 0.9885 0.9907 0.9848 0.9986 0.9915 0.9857 0.9984 0.9919 0.9988 0.9909 0.9887
dispcorr: -0.023346256 hartree
energy: -2950.759679016049
dipole: -1.17883 0.60857 -0.57025 9.21767 -7.77265 1.44502 -2.54780 1.91514 -0.63266
magnitude: 1.67736 au
magnitude: 4.26350 debye
