program: Orca
programVersion: 5.0.2
elementType: S S S P P O O O O O O C C C C C C C C C C C C C C C C H H H H H H H H H H H H H H H H H H H H
charge: 0
multiplicity: 1
keywords: wb97x-d3
keywords: def2-TZVPP
keywords: def2/J RIJCOSX
keywords: DEFGRID2
keywords: scfconv7
keywords: smallprint printgap noloewdin
keywords: NOSOSCF
formula: C16H20O6P2S3
InChI: InChI=1/C16H20O6P2S3/c1-17-23(25,18-2)21-13-5-9-15(10-6-13)27-16-11-7-14(8-12-16)22-24(26,19-3)20-4/h5-12H,1-4H3
47 atoms
S  0.151318 -3.339522 0.743104
S  -5.145604 1.097241 2.210534
S  5.693371 0.999609 1.256749
P  -5.332565 0.881779 0.314834
P  5.3097 1.250549 -0.601918
O  -4.974491 -0.574994 -0.28966
O  4.514988 0.055026 -1.347627
O  -4.438847 1.815262 -0.614622
O  -6.786176 1.084625 -0.298838
O  4.399105 2.490128 -1.014282
O  6.549917 1.420426 -1.582849
C  -1.340966 -2.443046 0.421205
C  1.408961 -2.268405 0.108846
C  -3.760745 -1.179991 -0.036411
C  3.482983 -0.678522 -0.819628
C  -2.39477 -2.599995 1.31722
C  1.495729 -0.933563 0.492346
C  -1.514831 -1.656953 -0.714409
C  2.370473 -2.799661 -0.742671
C  -3.610934 -1.975962 1.085938
C  2.516129 -0.129625 0.014766
C  -2.718289 -1.008855 -0.9344
C  3.418445 -2.011429 -1.191691
C  -4.189682 3.182051 -0.269482
C  -7.954672 0.593111 0.365701
C  4.608699 3.785299 -0.439438
C  7.742086 0.645459 -1.416257
H  -2.27208 -3.203609 2.207939
H  0.758399 -0.506085 1.159728
H  -0.713309 -1.537738 -1.431708
H  2.308861 -3.832727 -1.059588
H  -4.431068 -2.105046 1.779896
H  2.541713 0.913008 0.301793
H  -2.851707 -0.395642 -1.816352
H  4.172834 -2.427753 -1.84697
H  -5.117568 3.750214 -0.196149
H  -3.581726 3.596967 -1.069643
H  -3.644442 3.254604 0.671681
H  -8.06239 1.039207 1.355094
H  -8.803765 0.878717 -0.250438
H  -7.932178 -0.49378 0.458999
H  4.423483 3.770944 0.634563
H  5.619453 4.147949 -0.630289
H  3.89686 4.453679 -0.917522
H  8.384326 0.881712 -2.261466
H  8.252866 0.910743 -0.490716
H  7.529725 -0.424203 -1.420311
elementType: S P O C H
totalener: -2950.73584022 hartree
nucrepener: 3284.90686046 hartree
electener: -6235.64270068 hartree
twoeener: 4365.73304375 hartree
cpcmener: -0.03049311 hartree
kineticenergy: 2942.55063058 hartree
xcener: -192.748957156001 hartree
chargesum: -0.0000000
charge: -0.036762 -0.450018 -0.439654 0.767007 0.749804 -0.353084 -0.319937 -0.338429 -0.335920 -0.338220 -0.338992 0.033339 0.038455 0.256027 0.244437 -0.136440 -0.176135 -0.149114 -0.133800 -0.189247 -0.145636 -0.189734 -0.185115 -0.118023 -0.114456 -0.118090 -0.117432 0.134153 0.156133 0.153808 0.136774 0.144460 0.136535 0.150831 0.147980 0.126490 0.127845 0.113953 0.111041 0.129281 0.125939 0.113381 0.128277 0.130058 0.129430 0.114638 0.124165
qa: -0.0368 -0.4500 -0.4397 0.7670 0.7498 -0.3531 -0.3199 -0.3384 -0.3359 -0.3382 -0.3390 0.0333 0.0385 0.2560 0.2444 -0.1364 -0.1761 -0.1491 -0.1338 -0.1892 -0.1456 -0.1897 -0.1851 -0.1180 -0.1145 -0.1181 -0.1174 0.1342 0.1561 0.1538 0.1368 0.1445 0.1365 0.1508 0.1480 0.1265 0.1278 0.1140 0.1110 0.1293 0.1259 0.1134 0.1283 0.1301 0.1294 0.1146 0.1242
va: 2.3729 1.9894 1.9916 5.4932 5.4936 2.1066 2.1446 2.1117 2.1013 2.0883 2.1059 3.7827 3.7564 3.7096 3.7646 3.9577 3.9955 3.9145 3.9895 4.0401 3.9276 4.0458 4.0082 3.8485 3.8407 3.8407 3.8455 1.0122 0.9917 0.9894 1.0125 1.0086 1.0179 1.0063 1.0026 0.9860 0.9914 0.9987 1.0003 0.9909 0.9855 0.9984 0.9890 0.9907 0.9915 0.9979 0.9863
dispcorr: -0.022934001 hartree
energy: -2950.758774218659
dipole: 0.25175 -0.13011 0.12165 10.04848 -8.70206 1.34642 -4.67387 3.11731 -1.55656
magnitude: 2.06168 au
magnitude: 5.24037 debye
