program: Orca
programVersion: 5.0.2
elementType: S S S P P O O O O O O C C C C C C C C C C C C C C C C H H H H H H H H H H H H H H H H H H H H
charge: 0
multiplicity: 1
keywords: wb97x-d3
keywords: def2-TZVPP
keywords: def2/J RIJCOSX
keywords: DEFGRID2
keywords: scfconv7
keywords: smallprint printgap noloewdin
keywords: NOSOSCF
formula: C16H20O6P2S3
InChI: InChI=1/C16H20O6P2S3/c1-17-23(25,18-2)21-13-5-9-15(10-6-13)27-16-11-7-14(8-12-16)22-24(26,19-3)20-4/h5-12H,1-4H3
47 atoms
S  0.094687 -3.663107 0.02853
S  -5.002216 0.320095 2.994518
S  3.550802 2.308472 -0.083263
P  -5.052334 1.017378 1.216849
P  4.91502 1.300014 -0.971441
O  -4.546311 0.007088 0.04949
O  4.895199 -0.299804 -0.731712
O  -4.203593 2.347693 1.04213
O  -6.462418 1.434525 0.605938
O  4.956524 1.348074 -2.561306
O  6.427273 1.630738 -0.60306
C  -1.24459 -2.50306 0.03478
C  1.501159 -2.615281 -0.210561
C  -3.440197 -0.80244 0.099771
C  3.749179 -1.041111 -0.577974
C  -1.146601 -1.250812 0.632642
C  2.537239 -2.650674 0.713973
C  -2.455017 -2.896182 -0.527324
C  1.60521 -1.792632 -1.328766
C  -2.233831 -0.391971 0.651723
C  3.667683 -1.868331 0.528096
C  -3.555718 -2.055235 -0.480714
C  2.720762 -0.994402 -1.510147
C  -4.107558 3.051591 -0.206493
C  -7.576756 0.536017 0.618623
C  4.849451 2.594839 -3.259333
C  6.824008 1.865696 0.752826
H  -0.21808 -0.925477 1.083492
H  2.467452 -3.281237 1.590625
H  -2.549154 -3.860102 -1.011378
H  0.810034 -1.762121 -2.06251
H  -2.118946 0.587205 1.097902
H  4.474235 -1.894438 1.249584
H  -4.495654 -2.367469 -0.917612
H  2.78697 -0.36348 -2.386745
H  -5.018297 3.616694 -0.40019
H  -3.910044 2.378592 -1.040662
H  -3.273486 3.741538 -0.107911
H  -7.767455 0.160344 1.624267
H  -8.439352 1.104125 0.280062
H  -7.412389 -0.302676 -0.058446
H  4.874312 2.358778 -4.319855
H  3.910926 3.09667 -3.024211
H  5.684522 3.253818 -3.020219
H  6.307528 2.731229 1.167458
H  6.632653 0.993967 1.37937
H  7.893118 2.060808 0.732959
elementType: S P O C H
totalener: -2950.73638801 hartree
nucrepener: 3311.94370609 hartree
electener: -6262.68009409 hartree
twoeener: 4392.69715973 hartree
cpcmener: -0.03312093 hartree
kineticenergy: 2942.54461479 hartree
xcener: -192.747443355132 hartree
chargesum: 0.0000000
charge: -0.051711 -0.421265 -0.442674 0.717419 0.755413 -0.326712 -0.332145 -0.338618 -0.334132 -0.337373 -0.338983 0.033898 0.034568 0.242444 0.230651 -0.158303 -0.129891 -0.142650 -0.144608 -0.156503 -0.181661 -0.190064 -0.155452 -0.118667 -0.108116 -0.118674 -0.116107 0.151226 0.136511 0.134291 0.149907 0.138153 0.148943 0.148171 0.150579 0.125926 0.122488 0.127537 0.106665 0.127908 0.124424 0.129622 0.112134 0.128903 0.111758 0.125230 0.129540
qa: -0.0517 -0.4213 -0.4427 0.7174 0.7554 -0.3267 -0.3321 -0.3386 -0.3341 -0.3374 -0.3390 0.0339 0.0346 0.2424 0.2307 -0.1583 -0.1299 -0.1426 -0.1446 -0.1565 -0.1817 -0.1901 -0.1555 -0.1187 -0.1081 -0.1187 -0.1161 0.1512 0.1365 0.1343 0.1499 0.1382 0.1489 0.1482 0.1506 0.1259 0.1225 0.1275 0.1067 0.1279 0.1244 0.1296 0.1121 0.1289 0.1118 0.1252 0.1295
va: 2.3375 2.0299 1.9904 5.5164 5.4889 2.0784 2.1247 2.0900 2.0955 2.1000 2.1061 3.7732 3.7268 3.7461 3.7490 3.9450 3.9813 3.9740 3.9747 3.9374 4.0245 4.0249 3.9501 3.8392 3.8423 3.8397 3.8456 0.9925 1.0133 1.0120 0.9957 1.0182 0.9998 1.0008 1.0092 0.9931 0.9922 0.9892 1.0012 0.9892 0.9885 0.9905 0.9998 0.9886 1.0000 0.9853 0.9908
dispcorr: -0.023664307 hartree
energy: -2950.760052313553
dipole: 1.12978 -0.51690 0.61287 8.69586 -7.63670 1.05916 -8.32671 6.02647 -2.30024
magnitude: 2.60548 au
magnitude: 6.62260 debye
