program: Orca
programVersion: 5.0.2
elementType: S S S P P O O O O O O C C C C C C C C C C C C C C C C H H H H H H H H H H H H H H H H H H H H
charge: 0
multiplicity: 1
keywords: wb97x-d3
keywords: def2-TZVPP
keywords: def2/J RIJCOSX
keywords: DEFGRID2
keywords: scfconv7
keywords: smallprint printgap noloewdin
keywords: NOSOSCF
formula: C16H20O6P2S3
InChI: InChI=1/C16H20O6P2S3/c1-17-23(25,18-2)21-13-5-9-15(10-6-13)27-16-11-7-14(8-12-16)22-24(26,19-3)20-4/h5-12H,1-4H3
47 atoms
S  -0.10723 -3.739504 0.028592
S  -3.269999 2.356697 -0.152094
S  4.873928 0.821647 1.754505
P  -4.842863 1.295934 0.11132
P  4.854762 1.088583 -0.142888
O  -4.65303 -0.068488 0.962538
O  4.516636 -0.207011 -1.051803
O  -5.571334 0.734441 -1.18692
O  -6.053401 1.96461 0.898319
O  3.809206 2.140831 -0.719875
O  6.210703 1.564422 -0.825167
C  -1.445387 -2.609121 0.295949
C  1.245179 -2.635768 -0.278005
C  -3.584565 -0.909875 0.727136
C  3.424393 -1.005289 -0.781406
C  -1.372039 -1.630742 1.284844
C  1.102029 -1.503681 -1.075639
C  -2.603256 -2.739387 -0.460413
C  2.492199 -2.951736 0.250264
C  -2.434941 -0.769429 1.491328
C  2.187205 -0.678812 -1.316612
C  -3.682419 -1.893445 -0.241805
C  3.58756 -2.139808 -0.006068
C  -5.686801 1.529809 -2.372643
C  -5.825909 2.770551 2.059426
C  3.470283 3.333143 -0.002668
C  7.472783 0.99489 -0.463075
H  -0.480051 -1.529886 1.889525
H  0.142836 -1.253542 -1.510111
H  -2.668251 -3.494949 -1.232691
H  2.616091 -3.825548 0.87732
H  -2.377172 -0.003613 2.253646
H  2.071756 0.198757 -1.939109
H  -4.584948 -2.001838 -0.828829
H  4.55716 -2.386768 0.405938
H  -6.269857 2.432428 -2.189143
H  -6.202105 0.915786 -3.106537
H  -4.704942 1.803391 -2.758084
H  -6.801631 3.109922 2.396165
H  -5.353837 2.195277 2.856105
H  -5.206675 3.634931 1.8208
H  2.704886 3.836047 -0.587277
H  3.072497 3.098683 0.984063
H  4.332785 3.991101 0.099744
H  7.638937 1.054602 0.612649
H  7.5404 -0.044697 -0.783971
H  8.234819 1.576518 -0.975129
elementType: S P O C H
totalener: -2950.73657916 hartree
nucrepener: 3346.22955576 hartree
electener: -6296.96613492 hartree
twoeener: 4427.42421466 hartree
cpcmener: -0.02954140 hartree
kineticenergy: 2942.56322428 hartree
xcener: -192.747717748448 hartree
chargesum: -0.0000000
charge: -0.050434 -0.447276 -0.449865 0.766317 0.766446 -0.353139 -0.352904 -0.339732 -0.335662 -0.339678 -0.336137 0.026544 0.031733 0.256839 0.246516 -0.116361 -0.142938 -0.139990 -0.136058 -0.193153 -0.178986 -0.173018 -0.186446 -0.117243 -0.114712 -0.116874 -0.111932 0.150310 0.150758 0.135803 0.135094 0.148004 0.152591 0.152488 0.146205 0.126336 0.127987 0.113493 0.129131 0.126126 0.111209 0.127439 0.114246 0.127840 0.107857 0.126244 0.128981
qa: -0.0504 -0.4473 -0.4499 0.7663 0.7664 -0.3531 -0.3529 -0.3397 -0.3357 -0.3397 -0.3361 0.0265 0.0317 0.2568 0.2465 -0.1164 -0.1429 -0.1400 -0.1361 -0.1932 -0.1790 -0.1730 -0.1864 -0.1172 -0.1147 -0.1169 -0.1119 0.1503 0.1508 0.1358 0.1351 0.1480 0.1526 0.1525 0.1462 0.1263 0.1280 0.1135 0.1291 0.1261 0.1112 0.1274 0.1142 0.1278 0.1079 0.1262 0.1290
va: 2.3304 1.9899 1.9900 5.4934 5.4959 2.1027 2.1034 2.1128 2.1049 2.1104 2.1076 3.7340 3.7590 3.7114 3.7165 3.9172 3.9168 3.9873 3.9608 4.0107 4.0343 4.0544 4.0403 3.8472 3.8433 3.8442 3.8400 0.9935 0.9920 1.0141 1.0128 1.0035 1.0061 1.0053 1.0046 0.9863 0.9910 0.9991 0.9911 0.9854 1.0001 0.9911 0.9993 0.9860 1.0020 0.9866 0.9898
dispcorr: -0.023452256 hartree
energy: -2950.760031418532
dipole: -1.66889 1.01592 -0.65297 9.98238 -8.83844 1.14394 -1.95251 1.40147 -0.55104
magnitude: 1.42780 au
magnitude: 3.62919 debye
