program: Orca
programVersion: 5.0.2
elementType: S S S P P O O O O O O C C C C C C C C C C C C C C C C H H H H H H H H H H H H H H H H H H H H
charge: 0
multiplicity: 1
keywords: wb97x-d3
keywords: def2-TZVPP
keywords: def2/J RIJCOSX
keywords: DEFGRID2
keywords: scfconv7
keywords: smallprint printgap noloewdin
keywords: NOSOSCF
formula: C16H20O6P2S3
InChI: InChI=1/C16H20O6P2S3/c1-17-23(25,18-2)21-13-5-9-15(10-6-13)27-16-11-7-14(8-12-16)22-24(26,19-3)20-4/h5-12H,1-4H3
47 atoms
S  0.043014 -2.986286 0.314254
S  -5.276044 1.138681 2.695404
S  4.969243 0.939315 -2.797236
P  -5.861427 0.811759 0.901686
P  5.836554 0.755074 -1.099492
O  -4.719806 0.481052 -0.192403
O  4.897327 0.377326 0.16055
O  -6.61999 2.000085 0.162613
O  -6.844601 -0.414083 0.652429
O  6.95587 -0.365311 -0.94602
O  6.587691 2.037077 -0.530326
C  -1.334544 -1.88371 0.197993
C  1.4502 -1.920107 0.224578
C  -3.621221 -0.320624 -0.008092
C  3.768529 -0.40129 0.129238
C  -2.491769 -2.231633 0.885384
C  2.52177 -2.320875 -0.56412
C  -1.335014 -0.744911 -0.602963
C  1.553123 -0.752667 0.977163
C  -3.64267 -1.466024 0.772107
C  3.691693 -1.575659 -0.601366
C  -2.467401 0.046031 -0.686538
C  2.699859 0.018182 0.909983
C  -6.224568 3.362438 0.358097
C  -7.97933 -0.632811 1.499138
C  7.992773 -0.507067 -1.923921
C  6.01501 3.343561 -0.650308
H  -2.511039 -3.110067 1.51809
H  2.455644 -3.223166 -1.158416
H  -0.452959 -0.458998 -1.160989
H  0.736427 -0.430954 1.610447
H  -4.533169 -1.783306 1.297413
H  4.521803 -1.926208 -1.200092
H  -2.460323 0.938893 -1.298705
H  2.774103 0.934672 1.481352
H  -5.1951 3.52727 0.040604
H  -6.332765 3.655263 1.401508
H  -6.887395 3.965886 -0.254897
H  -8.663648 0.215106 1.473697
H  -8.4889 -1.511225 1.112139
H  -7.669929 -0.820507 2.526962
H  7.576183 -0.701073 -2.91277
H  8.623023 0.381303 -1.96262
H  8.595052 -1.357561 -1.616125
H  5.877426 3.616755 -1.696093
H  5.058795 3.407368 -0.13024
H  6.717687 4.031472 -0.188983
elementType: S P O C H
totalener: -2950.73566659 hartree
nucrepener: 3238.15231675 hartree
electener: -6188.88798334 hartree
twoeener: 4318.99360723 hartree
cpcmener: -0.03081415 hartree
kineticenergy: 2942.56397863 hartree
xcener: -192.754192509237 hartree
chargesum: 0.0000000
charge: -0.027704 -0.443009 -0.443179 0.751683 0.754578 -0.319048 -0.324765 -0.341243 -0.336730 -0.336635 -0.339236 0.040364 0.045029 0.236991 0.234172 -0.159931 -0.151532 -0.156947 -0.165751 -0.158069 -0.158596 -0.184475 -0.170339 -0.117176 -0.117873 -0.116437 -0.118719 0.133910 0.135300 0.155196 0.156483 0.135009 0.137903 0.148299 0.149740 0.125122 0.113214 0.128918 0.128258 0.129870 0.112580 0.111273 0.126917 0.129500 0.111972 0.125450 0.129666
qa: -0.0277 -0.4430 -0.4432 0.7517 0.7546 -0.3190 -0.3248 -0.3412 -0.3367 -0.3366 -0.3392 0.0404 0.0450 0.2370 0.2342 -0.1599 -0.1515 -0.1569 -0.1658 -0.1581 -0.1586 -0.1845 -0.1703 -0.1172 -0.1179 -0.1164 -0.1187 0.1339 0.1353 0.1552 0.1565 0.1350 0.1379 0.1483 0.1497 0.1251 0.1132 0.1289 0.1283 0.1299 0.1126 0.1113 0.1269 0.1295 0.1120 0.1255 0.1297
va: 2.3964 1.9899 1.9890 5.4936 5.4904 2.1473 2.1368 2.1044 2.0912 2.0954 2.1067 3.7890 3.7600 3.7667 3.7650 4.0023 4.0102 3.9335 3.9529 3.9613 3.9630 3.9900 3.9793 3.8440 3.8398 3.8409 3.8479 1.0142 1.0150 0.9886 0.9883 1.0188 1.0172 1.0036 1.0017 0.9859 0.9993 0.9916 0.9892 0.9904 0.9993 0.9999 0.9895 0.9899 0.9997 0.9851 0.9911
dispcorr: -0.022676896 hartree
energy: -2950.758343485078
dipole: -0.27416 0.35212 0.07796 7.50526 -6.36654 1.13872 -0.86912 0.72943 -0.13968
magnitude: 1.14990 au
magnitude: 2.92282 debye
