program: Orca
programVersion: 5.0.2
elementType: S S S P P O O O O O O C C C C C C C C C C C C C C C C H H H H H H H H H H H H H H H H H H H H
charge: 0
multiplicity: 1
keywords: wb97x-d3
keywords: def2-TZVPP
keywords: def2/J RIJCOSX
keywords: DEFGRID2
keywords: scfconv7
keywords: smallprint printgap noloewdin
keywords: NOSOSCF
formula: C16H20O6P2S3
InChI: InChI=1/C16H20O6P2S3/c1-17-23(25,18-2)21-13-5-9-15(10-6-13)27-16-11-7-14(8-12-16)22-24(26,19-3)20-4/h5-12H,1-4H3
47 atoms
S  -0.011533 -3.338277 -0.569645
S  -6.480081 -0.740491 -0.277221
S  3.960778 2.327568 -0.880314
P  -5.627745 0.679989 0.674491
P  5.346831 1.185269 -0.215007
O  -4.044927 0.884495 0.360227
O  5.119305 -0.404891 -0.392529
O  -5.737876 0.52996 2.250796
O  -6.138805 2.168788 0.439342
O  6.796432 1.342689 -0.854747
O  5.675632 1.250208 1.340308
C  -1.212831 -2.068028 -0.278504
C  1.493767 -2.403422 -0.509022
C  -3.146523 -0.132916 0.162836
C  3.897256 -1.031732 -0.414226
C  -1.292251 -0.955572 -1.111948
C  1.78353 -1.571128 0.568714
C  -2.11361 -2.205153 0.769542
C  2.422193 -2.55003 -1.532148
C  -2.253535 0.013511 -0.890079
C  2.979613 -0.876217 0.616114
C  -3.087338 -1.241517 0.99298
C  3.628036 -1.865631 -1.48529
C  -5.152542 1.468649 3.166125
C  -6.35272 2.67814 -0.881759
C  6.967596 1.452293 -2.271476
C  5.831034 2.50561 2.010864
H  -0.603009 -0.839717 -1.938414
H  1.075516 -1.457395 1.379624
H  -2.056832 -3.060577 1.430024
H  2.205892 -3.187997 -2.379269
H  -2.313651 0.881146 -1.534517
H  3.195864 -0.241831 1.46597
H  -3.763384 -1.360139 1.829679
H  4.35025 -1.976204 -2.284022
H  -5.230713 1.02337 4.154593
H  -5.697929 2.411757 3.156616
H  -4.101352 1.649705 2.942619
H  -7.019568 2.028719 -1.449464
H  -6.81575 3.654909 -0.768305
H  -5.409497 2.788647 -1.417646
H  6.616197 0.55548 -2.782956
H  6.442868 2.322998 -2.664542
H  8.034002 1.565894 -2.447244
H  5.950479 2.280307 3.067475
H  6.715455 3.033795 1.65462
H  4.951747 3.13581 1.875934
elementType: S P O C H
totalener: -2950.73650974 hartree
nucrepener: 3285.53198201 hartree
electener: -6236.26849174 hartree
twoeener: 4366.19577866 hartree
cpcmener: -0.03333293 hartree
kineticenergy: 2942.55477058 hartree
xcener: -192.748035867317 hartree
chargesum: 0.0000000
charge: -0.068208 -0.421925 -0.443803 0.722348 0.756046 -0.331880 -0.333580 -0.339137 -0.333973 -0.338714 -0.336579 0.029695 0.032597 0.256088 0.227457 -0.109602 -0.134830 -0.153476 -0.143735 -0.198127 -0.162391 -0.156372 -0.174338 -0.117443 -0.110263 -0.116890 -0.116253 0.145465 0.147928 0.135786 0.134244 0.149315 0.147595 0.140541 0.149466 0.127457 0.125823 0.121157 0.107370 0.128133 0.125439 0.124584 0.110786 0.129190 0.128842 0.128148 0.110019
qa: -0.0682 -0.4219 -0.4438 0.7223 0.7560 -0.3319 -0.3336 -0.3391 -0.3340 -0.3387 -0.3366 0.0297 0.0326 0.2561 0.2275 -0.1096 -0.1348 -0.1535 -0.1437 -0.1981 -0.1624 -0.1564 -0.1743 -0.1174 -0.1103 -0.1169 -0.1163 0.1455 0.1479 0.1358 0.1342 0.1493 0.1476 0.1405 0.1495 0.1275 0.1258 0.1212 0.1074 0.1281 0.1254 0.1246 0.1108 0.1292 0.1288 0.1281 0.1100
va: 2.2887 2.0265 1.9894 5.5081 5.4901 2.0724 2.1210 2.0941 2.0955 2.1057 2.1008 3.7260 3.7386 3.7306 3.7444 3.9305 3.9516 4.0036 3.9801 4.0220 3.9655 3.9558 4.0162 3.8390 3.8433 3.8492 3.8403 0.9941 0.9938 1.0156 1.0144 1.0004 1.0104 1.0135 0.9988 0.9892 0.9939 0.9917 1.0012 0.9895 0.9873 0.9850 0.9999 0.9907 0.9898 0.9886 1.0009
dispcorr: -0.023584215 hartree
energy: -2950.760093951232
dipole: 6.61028 -4.76927 1.84101 12.59952 -10.34955 2.24996 2.79483 -2.11637 0.67846
magnitude: 2.98529 au
magnitude: 7.58801 debye
