program: Orca
programVersion: 5.0.2
elementType: S S S P P O O O O O O C C C C C C C C C C C C C C C C H H H H H H H H H H H H H H H H H H H H
charge: 0
multiplicity: 1
keywords: wb97x-d3
keywords: def2-TZVPP
keywords: def2/J RIJCOSX
keywords: DEFGRID2
keywords: scfconv7
keywords: smallprint printgap noloewdin
keywords: NOSOSCF
formula: C16H20O6P2S3
InChI: InChI=1/C16H20O6P2S3/c1-17-23(25,18-2)21-13-5-9-15(10-6-13)27-16-11-7-14(8-12-16)22-24(26,19-3)20-4/h5-12H,1-4H3
47 atoms
S  0.051414 -2.434696 0.991407
S  -6.618121 -0.850899 1.254782
S  6.696773 -1.023326 -0.37007
P  -6.110925 0.623353 0.140965
P  6.090756 0.791432 -0.447589
O  -4.819704 0.396489 -0.805002
O  4.520788 1.014449 -0.760439
O  -5.710666 1.985581 0.860786
O  -7.170986 1.125725 -0.935586
O  6.239204 1.687519 0.858893
O  6.742147 1.725586 -1.559385
C  -1.376342 -1.548077 0.434401
C  1.369956 -1.375936 0.468588
C  -3.688444 -0.25453 -0.36157
C  3.509809 0.197488 -0.319495
C  -2.412085 -2.265722 -0.153346
C  1.497622 -0.983905 -0.861615
C  -1.50773 -0.174601 0.619885
C  2.324511 -0.976899 1.394912
C  -3.577809 -1.622139 -0.541054
C  2.561301 -0.192215 -1.254762
C  -2.660814 0.476369 0.214985
C  3.402667 -0.194654 1.004868
C  -6.448045 2.460234 1.994322
C  -7.945104 0.191452 -1.696505
C  7.477552 1.738617 1.576801
C  7.057699 1.221427 -2.862079
H  -2.314895 -3.331379 -0.317198
H  0.768492 -1.295121 -1.598467
H  -0.712055 0.397497 1.079386
H  2.231441 -1.264117 2.434175
H  -4.381243 -2.182018 -1.001096
H  2.659998 0.115187 -2.288036
H  -2.755767 1.546349 0.348415
H  4.123428 0.120393 1.747772
H  -5.970249 3.384795 2.307953
H  -6.413538 1.741282 2.812657
H  -7.486635 2.664708 1.733428
H  -8.57434 -0.416712 -1.046568
H  -8.575121 0.779059 -2.359398
H  -7.307402 -0.45938 -2.295935
H  8.280419 2.134247 0.954133
H  7.31974 2.406575 2.419642
H  7.757282 0.752453 1.947974
H  7.831164 0.455703 -2.806886
H  6.176283 0.812316 -3.356721
H  7.428185 2.065813 -3.43772
elementType: S P O C H
totalener: -2950.73673765 hartree
nucrepener: 3231.61573918 hartree
electener: -6182.35247683 hartree
twoeener: 4312.60216661 hartree
cpcmener: -0.03129334 hartree
kineticenergy: 2942.57112388 hartree
xcener: -192.750347867740 hartree
chargesum: 0.0000000
charge: -0.052112 -0.448116 -0.442123 0.766184 0.752134 -0.354248 -0.327832 -0.340406 -0.336408 -0.336015 -0.340357 0.030414 0.028150 0.245601 0.234012 -0.140148 -0.120770 -0.138646 -0.149510 -0.179936 -0.183962 -0.179672 -0.158151 -0.118170 -0.114019 -0.117266 -0.116444 0.135133 0.149575 0.152419 0.135422 0.147395 0.149451 0.152417 0.146639 0.128177 0.113395 0.125786 0.111462 0.129146 0.124949 0.127453 0.129448 0.111697 0.113872 0.124418 0.129567
qa: -0.0521 -0.4481 -0.4421 0.7662 0.7521 -0.3542 -0.3278 -0.3404 -0.3364 -0.3360 -0.3404 0.0304 0.0282 0.2456 0.2340 -0.1401 -0.1208 -0.1386 -0.1495 -0.1799 -0.1840 -0.1797 -0.1582 -0.1182 -0.1140 -0.1173 -0.1164 0.1351 0.1496 0.1524 0.1354 0.1474 0.1495 0.1524 0.1466 0.1282 0.1134 0.1258 0.1115 0.1291 0.1249 0.1275 0.1294 0.1117 0.1139 0.1244 0.1296
va: 2.3265 1.9886 1.9899 5.4937 5.4902 2.1016 2.1298 2.1130 2.1009 2.0989 2.1013 3.7556 3.7323 3.7185 3.7588 3.9707 3.9245 3.9202 4.0160 4.0268 4.0018 4.0485 3.9677 3.8481 3.8440 3.8412 3.8444 1.0135 0.9926 0.9897 1.0156 1.0028 1.0008 1.0056 1.0115 0.9908 0.9989 0.9863 0.9998 0.9912 0.9854 0.9893 0.9903 0.9997 0.9990 0.9857 0.9916
dispcorr: -0.022942725 hartree
energy: -2950.759680378966
dipole: 0.25662 -0.11153 0.14510 8.63457 -6.70587 1.92870 -2.60040 1.77481 -0.82559
magnitude: 2.10298 au
magnitude: 5.34535 debye
