program: Orca
programVersion: 5.0.2
elementType: S S S P P O O O O O O C C C C C C C C C C C C C C C C H H H H H H H H H H H H H H H H H H H H
charge: 0
multiplicity: 1
keywords: wb97x-d3
keywords: def2-TZVPP
keywords: def2/J RIJCOSX
keywords: DEFGRID2
keywords: scfconv7
keywords: smallprint printgap noloewdin
keywords: NOSOSCF
formula: C16H20O6P2S3
InChI: InChI=1/C16H20O6P2S3/c1-17-23(25,18-2)21-13-5-9-15(10-6-13)27-16-11-7-14(8-12-16)22-24(26,19-3)20-4/h5-12H,1-4H3
47 atoms
S  -0.145853 -2.931928 -0.596532
S  -6.638544 -0.90363 0.635128
S  5.732542 0.731221 -2.485594
P  -5.773129 0.768651 0.98945
P  5.771881 0.925627 -0.58119
O  -4.421056 1.081411 0.15687
O  5.041438 -0.229453 0.279914
O  -5.270037 1.024584 2.476901
O  -6.593982 2.096599 0.680295
O  7.201308 0.941644 0.11744
O  5.08692 2.214885 0.051791
C  -1.382704 -1.688156 -0.360886
C  1.363741 -2.047703 -0.329585
C  -3.426212 0.140043 0.002619
C  3.815438 -0.791274 0.027752
C  -1.418269 -0.899679 0.786478
C  2.404805 -2.708734 0.314349
C  -2.37782 -1.552231 -1.321903
C  1.564147 -0.752177 -0.793486
C  -2.433294 0.024439 0.965532
C  3.633475 -2.089977 0.476614
C  -3.412012 -0.646558 -1.135466
C  2.778155 -0.112954 -0.599651
C  -6.004747 0.55989 3.61444
C  -7.322653 2.242927 -0.543244
C  8.262131 0.086715 -0.321814
C  5.285168 3.512329 -0.521828
H  -0.652518 -0.999996 1.544925
H  2.264817 -3.712527 0.695224
H  -2.350745 -2.149741 -2.223909
H  0.770801 -0.220191 -1.302371
H  -2.449938 0.647709 1.850121
H  4.442604 -2.61062 0.972647
H  -4.186233 -0.540326 -1.883855
H  2.889972 0.90535 -0.946367
H  -5.409733 0.811493 4.488625
H  -6.147786 -0.519642 3.575332
H  -6.97388 1.053567 3.687151
H  -7.782855 3.227319 -0.514269
H  -6.661513 2.184028 -1.408636
H  -8.10133 1.48483 -0.629172
H  9.116144 0.303292 0.314814
H  7.994929 -0.964925 -0.214333
H  8.526051 0.290977 -1.359328
H  4.917967 3.546943 -1.547515
H  4.715255 4.209505 0.086989
H  6.337067 3.798605 -0.50163
elementType: S P O C H
totalener: -2950.73630740 hartree
nucrepener: 3247.74713393 hartree
electener: -6198.48344133 hartree
twoeener: 4328.61326036 hartree
cpcmener: -0.03073955 hartree
kineticenergy: 2942.55583020 hartree
xcener: -192.750131082524 hartree
chargesum: 0.0000000
charge: -0.042577 -0.446846 -0.442206 0.764149 0.751235 -0.352214 -0.315877 -0.339712 -0.336348 -0.339571 -0.337484 0.036825 0.027286 0.242881 0.251800 -0.151806 -0.135893 -0.131134 -0.168041 -0.163599 -0.191276 -0.183791 -0.158807 -0.117055 -0.114094 -0.118076 -0.115286 0.153166 0.134983 0.136574 0.153600 0.153364 0.146594 0.147320 0.130971 0.127485 0.113885 0.127902 0.129360 0.125343 0.110283 0.129281 0.125711 0.112416 0.111796 0.129637 0.127845
qa: -0.0426 -0.4468 -0.4422 0.7641 0.7512 -0.3522 -0.3159 -0.3397 -0.3363 -0.3396 -0.3375 0.0368 0.0273 0.2429 0.2518 -0.1518 -0.1359 -0.1311 -0.1680 -0.1636 -0.1913 -0.1838 -0.1588 -0.1171 -0.1141 -0.1181 -0.1153 0.1532 0.1350 0.1366 0.1536 0.1534 0.1466 0.1473 0.1310 0.1275 0.1139 0.1279 0.1294 0.1253 0.1103 0.1293 0.1257 0.1124 0.1118 0.1296 0.1278
va: 2.3561 1.9916 1.9910 5.4973 5.4978 2.1018 2.1550 2.1123 2.1039 2.1081 2.0884 3.7407 3.7797 3.7304 3.7546 3.9515 3.9711 3.9757 3.9780 4.0300 4.0103 4.0328 3.9389 3.8442 3.8445 3.8451 3.8391 0.9913 1.0117 1.0134 0.9910 1.0054 1.0038 1.0027 1.0225 0.9908 0.9995 0.9859 0.9906 0.9861 0.9997 0.9910 0.9855 0.9993 0.9996 0.9903 0.9896
dispcorr: -0.022845758 hartree
energy: -2950.759153156196
dipole: 1.22143 -0.76644 0.45499 8.86830 -7.18189 1.68641 4.07479 -3.05883 1.01596
magnitude: 2.02069 au
magnitude: 5.13617 debye
