program: Orca
programVersion: 5.0.2
elementType: S S S P P O O O O O O C C C C C C C C C C C C C C C C H H H H H H H H H H H H H H H H H H H H
charge: 0
multiplicity: 1
keywords: wb97x-d3
keywords: def2-TZVPP
keywords: def2/J RIJCOSX
keywords: DEFGRID2
keywords: scfconv7
keywords: smallprint printgap noloewdin
keywords: NOSOSCF
formula: C16H20O6P2S3
InChI: InChI=1/C16H20O6P2S3/c1-17-23(25,18-2)21-13-5-9-15(10-6-13)27-16-11-7-14(8-12-16)22-24(26,19-3)20-4/h5-12H,1-4H3
47 atoms
S  0.162028 -2.773784 1.05669
S  -5.555678 1.116132 2.193027
S  6.48429 -0.293927 0.42813
P  -5.784615 0.796563 0.317422
P  5.77613 0.844108 -0.938119
O  -5.170294 -0.580588 -0.260641
O  4.17624 1.090824 -0.905787
O  -5.146993 1.853112 -0.687793
O  -7.275496 0.687569 -0.229026
O  6.301823 2.344097 -0.987257
O  5.957587 0.392246 -2.45328
C  -1.392409 -2.024359 0.662488
C  1.333287 -1.599364 0.441544
C  -3.908652 -1.028448 0.071349
C  3.262201 0.165753 -0.464513
C  -2.47627 -2.322348 1.483652
C  2.251446 -2.000987 -0.520299
C  -1.580741 -1.220749 -0.457876
C  1.388336 -0.303924 0.949659
C  -3.738163 -1.832247 1.185659
C  3.224083 -1.121797 -0.973986
C  -2.83572 -0.708191 -0.744973
C  2.347757 0.581969 0.49301
C  -5.161601 3.256117 -0.402549
C  -8.276476 -0.047142 0.483036
C  6.516576 3.094254 0.213625
C  7.228922 -0.060132 -2.934424
H  -2.343635 -2.935681 2.366262
H  2.21144 -3.002533 -0.92826
H  -0.7540 -0.986505 -1.115561
H  0.683389 0.018089 1.705401
H  -4.579092 -2.075334 1.821491
H  3.923626 -1.444225 -1.734269
H  -2.97881 -0.085559 -1.618729
H  2.394825 1.589207 0.886962
H  -6.180838 3.641034 -0.361973
H  -4.628916 3.741877 -1.216238
H  -4.654108 3.470765 0.537939
H  -8.0354 -1.110356 0.518702
H  -8.395973 0.331576 1.498519
H  -9.207484 0.088524 -0.06163
H  7.30671 2.647337 0.816614
H  6.819704 4.091308 -0.095815
H  5.604203 3.168128 0.806767
H  7.077724 -0.370007 -3.96531
H  7.968365 0.740726 -2.905876
H  7.589417 -0.909543 -2.353392
elementType: S P O C H
totalener: -2950.73666960 hartree
nucrepener: 3253.55418734 hartree
electener: -6204.29085694 hartree
twoeener: 4334.48085104 hartree
cpcmener: -0.03077580 hartree
kineticenergy: 2942.56586051 hartree
xcener: -192.750231300173 hartree
chargesum: -0.0000000
charge: -0.044930 -0.450566 -0.440570 0.767054 0.754301 -0.353740 -0.333452 -0.339738 -0.336083 -0.338672 -0.337443 0.042581 0.039674 0.244597 0.229108 -0.145861 -0.141978 -0.155381 -0.138409 -0.179545 -0.156411 -0.185193 -0.169476 -0.117635 -0.112985 -0.116758 -0.116779 0.133387 0.136933 0.152429 0.150052 0.145369 0.147923 0.151386 0.150991 0.125943 0.127624 0.113223 0.125527 0.109397 0.128963 0.113683 0.129214 0.124235 0.129326 0.127378 0.111305
qa: -0.0449 -0.4506 -0.4406 0.7671 0.7543 -0.3537 -0.3335 -0.3397 -0.3361 -0.3387 -0.3374 0.0426 0.0397 0.2446 0.2291 -0.1459 -0.1420 -0.1554 -0.1384 -0.1795 -0.1564 -0.1852 -0.1695 -0.1176 -0.1130 -0.1168 -0.1168 0.1334 0.1369 0.1524 0.1501 0.1454 0.1479 0.1514 0.1510 0.1259 0.1276 0.1132 0.1255 0.1094 0.1290 0.1137 0.1292 0.1242 0.1293 0.1274 0.1113
va: 2.3525 1.9883 1.9915 5.4964 5.4895 2.1040 2.1227 2.1130 2.1032 2.1043 2.1003 3.7910 3.7320 3.7140 3.7628 3.9581 4.0158 3.9166 3.9527 4.0293 3.9675 4.0583 3.9933 3.8481 3.8423 3.8475 3.8404 1.0120 1.0148 0.9907 0.9943 1.0062 1.0097 1.0058 0.9988 0.9860 0.9909 0.9993 0.9862 1.0009 0.9905 0.9991 0.9914 0.9852 0.9901 0.9891 1.0004
dispcorr: -0.022949802 hartree
energy: -2950.759619399892
dipole: 0.00291 0.02246 0.02538 8.43268 -7.04013 1.39255 -4.65050 3.32393 -1.32658
magnitude: 1.92345 au
magnitude: 4.88902 debye
