program: Orca
programVersion: 5.0.2
elementType: S S S P P O O O O O O C C C C C C C C C C C C C C C C H H H H H H H H H H H H H H H H H H H H
charge: 0
multiplicity: 1
keywords: wb97x-d3
keywords: def2-TZVPP
keywords: def2/J RIJCOSX
keywords: DEFGRID2
keywords: scfconv7
keywords: smallprint printgap noloewdin
keywords: NOSOSCF
formula: C16H20O6P2S3
InChI: InChI=1/C16H20O6P2S3/c1-17-23(25,18-2)21-13-5-9-15(10-6-13)27-16-11-7-14(8-12-16)22-24(26,19-3)20-4/h5-12H,1-4H3
47 atoms
S  0.174378 -3.082689 0.233774
S  -6.190868 -0.524812 -1.700176
S  5.481734 1.36347 2.036257
P  -5.765231 0.702728 -0.293111
P  5.805964 1.01496 0.179832
O  -4.699074 0.203874 0.813448
O  4.50603 0.821741 -0.759426
O  -6.955316 1.157533 0.658658
O  -5.121032 2.100813 -0.694992
O  6.574166 2.134933 -0.648203
O  6.639115 -0.291612 -0.180819
C  -1.274023 -2.074903 0.367003
C  1.447871 -1.87993 -0.027803
C  -3.579606 -0.556221 0.600029
C  3.515029 -0.092912 -0.471359
C  -2.095092 -2.217894 1.478811
C  2.532634 -2.245292 -0.818947
C  -1.626156 -1.175629 -0.63528
C  1.416498 -0.615837 0.554547
C  -3.258803 -1.472946 1.58793
C  3.576526 -1.357892 -1.030714
C  -2.765968 -0.399395 -0.515194
C  2.443704 0.283734 0.323053
C  -8.009687 0.256009 1.010805
C  -5.672107 2.87404 -1.765754
C  6.277901 3.524106 -0.476827
C  7.72204 -0.729878 0.6466
H  -1.829531 -2.908145 2.268891
H  2.565863 -3.220976 -1.287359
H  -1.001046 -1.059917 -1.511237
H  0.588632 -0.318081 1.184574
H  -3.900818 -1.586296 2.45199
H  4.410876 -1.641472 -1.658992
H  -2.999134 0.320714 -1.288238
H  2.406394 1.274566 0.75624
H  -8.64643 0.785598 1.714745
H  -7.625313 -0.645659 1.488524
H  -8.594984 -0.020318 0.134205
H  -6.710552 3.142849 -1.569202
H  -5.077467 3.781437 -1.83102
H  -5.609493 2.334983 -2.711181
H  5.24076 3.745259 -0.731406
H  6.476439 3.844641 0.545967
H  6.932053 4.066436 -1.155017
H  8.518054 0.014246 0.68538
H  7.379457 -0.947105 1.657856
H  8.107509 -1.639658 0.193898
elementType: S P O C H
totalener: -2950.73586790 hartree
nucrepener: 3250.18891070 hartree
electener: -6200.92477859 hartree
twoeener: 4331.10765235 hartree
cpcmener: -0.03033948 hartree
kineticenergy: 2942.57983020 hartree
xcener: -192.754557339168 hartree
chargesum: -0.0000000
charge: -0.043371 -0.441303 -0.449611 0.750979 0.765008 -0.318988 -0.351417 -0.340161 -0.336392 -0.335589 -0.339742 0.036410 0.038634 0.246636 0.250866 -0.126429 -0.145573 -0.168927 -0.146430 -0.188920 -0.180939 -0.145362 -0.192865 -0.116874 -0.117427 -0.114154 -0.116193 0.135751 0.133715 0.152903 0.154700 0.148442 0.150637 0.137096 0.145855 0.129176 0.124138 0.114114 0.126922 0.129956 0.112164 0.125107 0.111121 0.128956 0.125982 0.114054 0.127343
qa: -0.0434 -0.4413 -0.4496 0.7510 0.7650 -0.3190 -0.3514 -0.3402 -0.3364 -0.3356 -0.3397 0.0364 0.0386 0.2466 0.2509 -0.1264 -0.1456 -0.1689 -0.1464 -0.1889 -0.1809 -0.1454 -0.1929 -0.1169 -0.1174 -0.1142 -0.1162 0.1358 0.1337 0.1529 0.1547 0.1484 0.1506 0.1371 0.1459 0.1292 0.1241 0.1141 0.1269 0.1300 0.1122 0.1251 0.1111 0.1290 0.1260 0.1141 0.1273
va: 2.3561 1.9896 1.9903 5.4914 5.4988 2.1461 2.1064 2.1025 2.0915 2.1015 2.1119 3.7448 3.7753 3.7605 3.7144 3.9920 3.9679 3.9924 3.9112 4.0133 4.0669 3.9348 4.0297 3.8446 3.8419 3.8427 3.8465 1.0128 1.0121 0.9935 0.9891 1.0025 1.0050 1.0186 1.0096 0.9921 0.9863 0.9984 0.9892 0.9905 0.9994 0.9858 0.9998 0.9910 0.9862 0.9991 0.9913
dispcorr: -0.022820672 hartree
energy: -2950.758688567716
dipole: 0.30606 -0.44418 -0.13812 7.58480 -6.30978 1.27502 -0.94982 0.73440 -0.21542
magnitude: 1.30045 au
magnitude: 3.30547 debye
