program: Orca
programVersion: 5.0.2
elementType: S S S P P O O O O O O C C C C C C C C C C C C C C C C H H H H H H H H H H H H H H H H H H H H
charge: 0
multiplicity: 1
keywords: wb97x-d3
keywords: def2-TZVPP
keywords: def2/J RIJCOSX
keywords: DEFGRID2
keywords: scfconv7
keywords: smallprint printgap noloewdin
keywords: NOSOSCF
formula: C16H20O6P2S3
InChI: InChI=1/C16H20O6P2S3/c1-17-23(25,18-2)21-13-5-9-15(10-6-13)27-16-11-7-14(8-12-16)22-24(26,19-3)20-4/h5-12H,1-4H3
47 atoms
S  -0.112644 -3.079827 0.010893
S  -5.525729 1.105721 -2.004338
S  6.046574 -0.069607 1.769452
P  -5.819586 0.916416 -0.11974
P  5.753029 0.836811 0.108229
O  -4.509209 0.79528 0.81712
O  4.764021 0.120402 -0.95315
O  -6.647838 -0.354407 0.359019
O  -6.569339 2.10936 0.621819
O  5.096343 2.285143 0.154125
O  7.025995 1.085643 -0.812599
C  -1.401802 -1.884194 0.218819
C  1.318569 -2.073568 -0.253075
C  -3.501928 -0.115159 0.576538
C  3.628485 -0.592379 -0.66539
C  -2.455819 -2.209324 1.067314
C  1.665189 -1.052935 0.626866
C  -1.416227 -0.669003 -0.460054
C  2.142169 -2.348681 -1.338046
C  -3.517127 -1.33276 1.235408
C  2.802622 -0.294102 0.411913
C  -2.458682 0.22283 -0.271001
C  3.307051 -1.622745 -1.534641
C  -7.773527 -0.83186 -0.386642
C  -6.248696 3.474478 0.332644
C  5.518996 3.257177 1.116684
C  8.043408 0.086971 -0.951938
H  -2.453162 -3.145148 1.612099
H  1.039662 -0.830061 1.481553
H  -0.612367 -0.402622 -1.133525
H  1.880772 -3.131225 -2.038675
H  -4.329231 -1.585999 1.904597
H  3.028209 0.515619 1.092392
H  -2.45501 1.1773 -0.780316
H  3.951493 -1.845443 -2.375416
H  -8.540193 -0.063286 -0.487493
H  -8.181162 -1.668701 0.174765
H  -7.469407 -1.174548 -1.375135
H  -6.877071 4.083402 0.977682
H  -5.201977 3.692418 0.547983
H  -6.462599 3.71518 -0.708668
H  6.573733 3.50447 0.994718
H  4.921827 4.147478 0.937503
H  5.342587 2.903986 2.132679
H  8.554226 -0.083356 -0.004697
H  7.633754 -0.854984 -1.317933
H  8.753921 0.47027 -1.679886
elementType: S P O C H
totalener: -2950.73555972 hartree
nucrepener: 3250.63711687 hartree
electener: -6201.37267659 hartree
twoeener: 4331.56032395 hartree
cpcmener: -0.03031349 hartree
kineticenergy: 2942.55855904 hartree
xcener: -192.751328280222 hartree
chargesum: 0.0000000
charge: -0.037789 -0.448763 -0.441236 0.763630 0.752148 -0.351344 -0.319109 -0.339336 -0.335812 -0.336643 -0.338965 0.040817 0.037025 0.248227 0.253718 -0.146585 -0.178258 -0.151107 -0.129526 -0.179295 -0.144973 -0.188685 -0.188141 -0.116906 -0.113805 -0.116439 -0.118952 0.134261 0.154256 0.155356 0.135647 0.150609 0.131834 0.145631 0.147988 0.125329 0.128107 0.114450 0.128621 0.125171 0.111083 0.127685 0.129552 0.112269 0.114308 0.124708 0.129239
qa: -0.0378 -0.4488 -0.4412 0.7636 0.7521 -0.3513 -0.3191 -0.3393 -0.3358 -0.3366 -0.3390 0.0408 0.0370 0.2482 0.2537 -0.1466 -0.1783 -0.1511 -0.1295 -0.1793 -0.1450 -0.1887 -0.1881 -0.1169 -0.1138 -0.1164 -0.1190 0.1343 0.1543 0.1554 0.1356 0.1506 0.1318 0.1456 0.1480 0.1253 0.1281 0.1144 0.1286 0.1252 0.1111 0.1277 0.1296 0.1123 0.1143 0.1247 0.1292
va: 2.3706 1.9902 1.9887 5.4994 5.4932 2.1056 2.1496 2.1143 2.0987 2.0903 2.1078 3.7786 3.7553 3.7155 3.7622 3.9686 3.9937 3.9187 3.9925 4.0683 3.9188 4.0253 4.0076 3.8485 3.8432 3.8409 3.8482 1.0116 0.9920 0.9886 1.0126 1.0045 1.0225 1.0096 1.0028 0.9864 0.9913 0.9982 0.9914 0.9857 0.9997 0.9890 0.9904 0.9990 0.9979 0.9859 0.9917
dispcorr: -0.022762047 hartree
energy: -2950.758321766061
dipole: -0.53819 0.66194 0.12375 7.45944 -6.24138 1.21806 0.26417 -0.17898 0.08519
magnitude: 1.22729 au
magnitude: 3.11953 debye
