program: Orca
programVersion: 5.0.2
elementType: S S S P P O O O O O O C C C C C C C C C C C C C C C C H H H H H H H H H H H H H H H H H H H H
charge: 0
multiplicity: 1
keywords: wb97x-d3
keywords: def2-TZVPP
keywords: def2/J RIJCOSX
keywords: DEFGRID2
keywords: scfconv7
keywords: smallprint printgap noloewdin
keywords: NOSOSCF
formula: C16H20O6P2S3
InChI: InChI=1/C16H20O6P2S3/c1-17-23(25,18-2)21-13-5-9-15(10-6-13)27-16-11-7-14(8-12-16)22-24(26,19-3)20-4/h5-12H,1-4H3
47 atoms
S  -0.176361 -2.646739 -0.497993
S  -5.445618 2.153641 -1.245284
S  6.642322 -1.434275 -0.20125
P  -6.022113 1.046949 0.210566
P  6.107359 0.403798 -0.157623
O  -4.881036 0.50799 1.218974
O  4.610702 0.703031 0.378945
O  -6.750442 -0.317974 -0.161981
O  -7.03185 1.692399 1.258688
O  6.944949 1.385858 0.773506
O  6.08448 1.207578 -1.531347
C  -1.535506 -1.640507 0.026243
C  1.229464 -1.604988 -0.236194
C  -3.780164 -0.199807 0.779348
C  3.514888 -0.087088 0.138523
C  -1.53307 -0.251231 -0.050064
C  2.009009 -1.232791 -1.324076
C  -2.673594 -2.299856 0.483919
C  1.604299 -1.211171 1.04583
C  -2.65179 0.471415 0.33588
C  3.158442 -0.477006 -1.142192
C  -3.80233 -1.582746 0.846167
C  2.742881 -0.448419 1.234305
C  -7.714598 -0.370691 -1.219885
C  -6.916087 3.060787 1.664644
C  7.399233 0.976142 2.06768
C  7.168916 1.113088 -2.461953
H  -0.662078 0.282028 -0.408073
H  1.721181 -1.52428 -2.325676
H  -2.686556 -3.379577 0.566151
H  1.0117 -1.502732 1.903397
H  -2.639705 1.552239 0.289331
H  3.744101 -0.183365 -2.003452
H  -4.681147 -2.101063 1.207297
H  3.036888 -0.140795 2.229685
H  -8.072667 -1.396093 -1.26132
H  -7.260798 -0.10805 -2.175423
H  -8.556805 0.293323 -1.02251
H  -7.737696 3.250198 2.35081
H  -5.972049 3.243176 2.179149
H  -6.998968 3.732698 0.810423
H  7.913347 1.831418 2.498998
H  6.5653 0.699199 2.71371
H  8.093619 0.139465 1.991802
H  7.324352 0.082116 -2.78021
H  6.890465 1.716113 -3.322473
H  8.091694 1.505741 -2.033977
elementType: S P O C H
totalener: -2950.73647291 hartree
nucrepener: 3229.63500617 hartree
electener: -6180.37147908 hartree
twoeener: 4310.66110126 hartree
cpcmener: -0.03065848 hartree
kineticenergy: 2942.54841400 hartree
xcener: -192.747110598818 hartree
chargesum: -0.0000000
charge: -0.047774 -0.450045 -0.441847 0.765746 0.753720 -0.352591 -0.329268 -0.337253 -0.337625 -0.339162 -0.337019 0.043507 0.032963 0.252471 0.229650 -0.151359 -0.136664 -0.150563 -0.130385 -0.194965 -0.159759 -0.182966 -0.171399 -0.117912 -0.113830 -0.116771 -0.117500 0.152886 0.136617 0.133608 0.149942 0.144766 0.150557 0.149564 0.149892 0.127281 0.114079 0.125337 0.129286 0.125567 0.112112 0.129317 0.124966 0.112668 0.112038 0.129587 0.128530
qa: -0.0478 -0.4500 -0.4418 0.7657 0.7537 -0.3526 -0.3293 -0.3373 -0.3376 -0.3392 -0.3370 0.0435 0.0330 0.2525 0.2296 -0.1514 -0.1367 -0.1506 -0.1304 -0.1950 -0.1598 -0.1830 -0.1714 -0.1179 -0.1138 -0.1168 -0.1175 0.1529 0.1366 0.1336 0.1499 0.1448 0.1506 0.1496 0.1499 0.1273 0.1141 0.1253 0.1293 0.1256 0.1121 0.1293 0.1250 0.1127 0.1120 0.1296 0.1285
va: 2.3482 1.9900 1.9908 5.4961 5.4894 2.1088 2.1276 2.1139 2.0980 2.1041 2.0992 3.8033 3.7352 3.7098 3.7675 3.9131 4.0169 3.9562 3.9492 4.0326 3.9719 4.0642 3.9935 3.8496 3.8387 3.8459 3.8390 0.9910 1.0147 1.0114 0.9952 1.0115 1.0093 1.0048 0.9997 0.9912 0.9986 0.9861 0.9910 0.9858 1.0006 0.9912 0.9851 0.9993 0.9999 0.9904 0.9887
dispcorr: -0.022772908 hartree
energy: -2950.759245822095
dipole: -0.82312 0.79146 -0.03166 6.16733 -5.07077 1.09656 1.43155 -0.75065 0.68090
magnitude: 1.29116 au
magnitude: 3.28186 debye
