program: Orca
programVersion: 5.0.2
elementType: S S S P P O O O O O O C C C C C C C C C C C C C C C C H H H H H H H H H H H H H H H H H H H H
charge: 0
multiplicity: 1
keywords: wb97x-d3
keywords: def2-TZVPP
keywords: def2/J RIJCOSX
keywords: DEFGRID2
keywords: scfconv7
keywords: smallprint printgap noloewdin
keywords: NOSOSCF
formula: C16H20O6P2S3
InChI: InChI=1/C16H20O6P2S3/c1-17-23(25,18-2)21-13-5-9-15(10-6-13)27-16-11-7-14(8-12-16)22-24(26,19-3)20-4/h5-12H,1-4H3
47 atoms
S  0.054108 -3.230762 -0.459199
S  -5.413657 0.273458 3.093709
S  5.060545 1.18019 -2.874405
P  -5.452133 0.893621 1.281493
P  5.550929 0.987982 -1.032152
O  -4.947529 -0.135917 0.144959
O  4.338114 0.816246 0.023522
O  -4.579714 2.171921 0.913904
O  -6.875041 1.2781 0.683633
O  6.456291 -0.261641 -0.646255
O  6.334983 2.193833 -0.352825
C  -1.413885 -2.266462 -0.240179
C  1.321202 -1.999445 -0.343131
C  -3.764928 -0.824753 0.089541
C  3.357733 -0.138485 -0.143156
C  -1.507041 -1.28524 0.740709
C  1.219668 -0.778335 -1.005511
C  -2.518597 -2.534721 -1.04065
C  2.461083 -2.288224 0.397953
C  -2.668775 -0.547681 0.896933
C  2.230175 0.160513 -0.893913
C  -3.696865 -1.827791 -0.865598
C  3.491721 -1.363407 0.486463
C  -4.509468 3.30074 1.792727
C  -8.037964 0.489215 0.958919
C  7.452002 -0.772825 -1.539947
C  6.003134 3.557867 -0.632942
H  -0.665312 -1.071257 1.386439
H  0.346225 -0.545568 -1.600828
H  -2.466509 -3.290334 -1.814267
H  2.548756 -3.231007 0.922627
H  -2.693962 0.223764 1.654391
H  2.139083 1.11956 -1.386168
H  -4.553644 -2.037525 -1.493157
H  4.372117 -1.58619 1.075075
H  -4.096619 3.019032 2.761619
H  -5.491101 3.754649 1.933389
H  -3.848606 4.02097 1.31709
H  -8.867981 0.974217 0.450905
H  -7.928911 -0.525662 0.57422
H  -8.242863 0.452448 2.029001
H  7.012985 -1.055455 -2.496842
H  8.246263 -0.044277 -1.705428
H  7.870902 -1.655418 -1.062591
H  6.732727 4.168292 -0.106146
H  6.064292 3.767039 -1.701642
H  5.003339 3.804118 -0.271894
elementType: S P O C H
totalener: -2950.73490501 hartree
nucrepener: 3264.23381965 hartree
electener: -6214.96872466 hartree
twoeener: 4345.06958018 hartree
cpcmener: -0.02984011 hartree
kineticenergy: 2942.56340602 hartree
xcener: -192.752912478268 hartree
chargesum: 0.0000000
charge: -0.041555 -0.443100 -0.449074 0.748958 0.766351 -0.308290 -0.351836 -0.335089 -0.339357 -0.339749 -0.335566 0.020236 0.034908 0.281553 0.256022 -0.175983 -0.144994 -0.126808 -0.139449 -0.157784 -0.184636 -0.204815 -0.183967 -0.115588 -0.117675 -0.116277 -0.113843 0.154834 0.154582 0.134918 0.135328 0.122367 0.146766 0.146997 0.150549 0.112281 0.128263 0.130142 0.128573 0.125619 0.111924 0.114002 0.127419 0.127149 0.129129 0.110462 0.126105
qa: -0.0416 -0.4431 -0.4491 0.7490 0.7664 -0.3083 -0.3518 -0.3351 -0.3394 -0.3397 -0.3356 0.0202 0.0349 0.2816 0.2560 -0.1760 -0.1450 -0.1268 -0.1394 -0.1578 -0.1846 -0.2048 -0.1840 -0.1156 -0.1177 -0.1163 -0.1138 0.1548 0.1546 0.1349 0.1353 0.1224 0.1468 0.1470 0.1505 0.1123 0.1283 0.1301 0.1286 0.1256 0.1119 0.1140 0.1274 0.1271 0.1291 0.1105 0.1261
va: 2.3596 1.9897 1.9902 5.5040 5.4959 2.1782 2.1057 2.0871 2.1115 2.1123 2.1041 3.7698 3.7492 3.7373 3.7157 4.0001 3.9274 3.9782 3.9821 3.9331 4.0162 4.0160 4.0683 3.8386 3.8471 3.8449 3.8399 0.9903 0.9892 1.0118 1.0129 1.0309 1.0089 1.0047 1.0049 0.9991 0.9887 0.9905 0.9908 0.9859 0.9991 0.9993 0.9858 0.9912 0.9906 1.0007 0.9856
dispcorr: -0.022762130 hartree
energy: -2950.757667135382
dipole: 1.33443 -1.22081 0.11363 8.11909 -6.82046 1.29863 0.35423 -0.29200 0.06223
magnitude: 1.30507 au
magnitude: 3.31723 debye
