program: Orca
programVersion: 5.0.2
elementType: S S S P P O O O O O O C C C C C C C C C C C C C C C C H H H H H H H H H H H H H H H H H H H H
charge: 0
multiplicity: 1
keywords: wb97x-d3
keywords: def2-TZVPP
keywords: def2/J RIJCOSX
keywords: DEFGRID2
keywords: scfconv7
keywords: smallprint printgap noloewdin
keywords: NOSOSCF
formula: C16H20O6P2S3
InChI: InChI=1/C16H20O6P2S3/c1-17-23(25,18-2)21-13-5-9-15(10-6-13)27-16-11-7-14(8-12-16)22-24(26,19-3)20-4/h5-12H,1-4H3
47 atoms
S  0.072254 -3.716004 0.035757
S  -4.548198 1.093643 -1.854553
S  3.327366 2.11725 0.779528
P  -4.827237 1.167015 0.039679
P  4.887975 1.271009 0.059551
O  -4.631615 -0.222037 0.849535
O  4.62962 -0.050182 -0.838475
O  -6.278065 1.576891 0.549015
O  -3.894915 2.143113 0.881518
O  5.803329 2.130878 -0.920484
O  5.964214 0.712683 1.091404
C  -1.304857 -2.623223 0.259541
C  1.405591 -2.573551 -0.204379
C  -3.51944 -1.01111 0.641812
C  3.556061 -0.884568 -0.610959
C  -2.458459 -2.833423 -0.486492
C  1.314999 -1.538891 -1.132407
C  -1.272381 -1.605763 1.209638
C  2.584435 -2.760374 0.507525
C  -3.573563 -2.030512 -0.292584
C  2.384931 -0.683231 -1.325687
C  -2.373856 -0.787734 1.392156
C  3.668681 -1.918626 0.300809
C  -7.448272 1.06001 -0.096226
C  -3.352966 3.339204 0.309753
C  5.214438 2.916686 -1.963016
C  6.37423 1.506704 2.211614
H  -2.491064 -3.617102 -1.232447
H  0.406194 -1.390065 -1.701312
H  -0.385022 -1.442275 1.807542
H  2.66221 -3.556822 1.236359
H  -4.471659 -2.194566 -0.873251
H  2.314729 0.126769 -2.040294
H  -2.347165 0.002753 2.130835
H  4.58728 -2.066231 0.854095
H  -7.452217 -0.030487 -0.10847
H  -7.527364 1.433534 -1.117039
H  -8.300301 1.409791 0.480898
H  -2.69832 3.108178 -0.529692
H  -4.140284 4.018019 -0.018046
H  -2.774472 3.818322 1.095329
H  6.036009 3.354995 -2.523901
H  4.614238 2.302307 -2.635651
H  4.594901 3.712911 -1.550155
H  7.116346 0.922667 2.749557
H  6.825192 2.445853 1.889679
H  5.531966 1.715205 2.871204
elementType: S P O C H
totalener: -2950.73639387 hartree
nucrepener: 3348.20062430 hartree
electener: -6298.93701817 hartree
twoeener: 4429.36633064 hartree
cpcmener: -0.03039116 hartree
kineticenergy: 2942.56262359 hartree
xcener: -192.746328625461 hartree
chargesum: 0.0000000
charge: -0.055969 -0.447449 -0.447331 0.767983 0.766661 -0.353070 -0.356876 -0.337219 -0.343177 -0.336482 -0.339572 0.022690 0.034050 0.258301 0.244423 -0.130112 -0.125855 -0.126245 -0.146949 -0.187442 -0.184373 -0.182729 -0.167326 -0.115691 -0.115283 -0.116368 -0.119175 0.135604 0.149628 0.148591 0.135229 0.145677 0.150507 0.152096 0.152415 0.124126 0.113090 0.129725 0.114911 0.127872 0.128266 0.130735 0.123561 0.112312 0.128552 0.124876 0.112811
qa: -0.0560 -0.4474 -0.4473 0.7680 0.7667 -0.3531 -0.3569 -0.3372 -0.3432 -0.3365 -0.3396 0.0227 0.0341 0.2583 0.2444 -0.1301 -0.1259 -0.1262 -0.1469 -0.1874 -0.1844 -0.1827 -0.1673 -0.1157 -0.1153 -0.1164 -0.1192 0.1356 0.1496 0.1486 0.1352 0.1457 0.1505 0.1521 0.1524 0.1241 0.1131 0.1297 0.1149 0.1279 0.1283 0.1307 0.1236 0.1123 0.1286 0.1249 0.1128
va: 2.3146 1.9877 1.9863 5.4861 5.4892 2.1003 2.0977 2.1026 2.1060 2.1015 2.1136 3.7413 3.7360 3.7079 3.7048 3.9630 3.9174 3.9281 3.9849 4.0360 4.0031 4.0363 4.0546 3.8455 3.8411 3.8498 3.8498 1.0140 0.9928 0.9941 1.0143 1.0055 0.9975 1.0057 1.0039 0.9859 0.9984 0.9916 0.9983 0.9872 0.9920 0.9912 0.9848 0.9990 0.9907 0.9868 0.9987
dispcorr: -0.023610489 hartree
energy: -2950.760004358298
dipole: 1.71673 -1.26286 0.45387 10.22717 -9.01619 1.21098 0.51976 -0.32872 0.19104
magnitude: 1.30728 au
magnitude: 3.32283 debye
