program: Orca
programVersion: 5.0.2
elementType: S S S P P O O O O O O C C C C C C C C C C C C C C C C H H H H H H H H H H H H H H H H H H H H
charge: 0
multiplicity: 1
keywords: wb97x-d3
keywords: def2-TZVPP
keywords: def2/J RIJCOSX
keywords: DEFGRID2
keywords: scfconv7
keywords: smallprint printgap noloewdin
keywords: NOSOSCF
formula: C16H20O6P2S3
InChI: InChI=1/C16H20O6P2S3/c1-17-23(25,18-2)21-13-5-9-15(10-6-13)27-16-11-7-14(8-12-16)22-24(26,19-3)20-4/h5-12H,1-4H3
47 atoms
S  0.036096 -3.96661 0.511977
S  -2.511706 2.32063 0.717951
S  3.57037 0.795714 -3.013764
P  -4.198623 1.437793 0.940667
P  4.123284 1.201765 -1.223674
O  -4.353143 -0.005778 0.223701
O  4.423592 -0.074805 -0.266492
O  -5.491675 2.173602 0.379515
O  -4.650359 1.080289 2.421792
O  5.479901 2.009745 -1.041487
O  3.12513 2.047084 -0.31973
C  -1.302116 -2.803444 0.407648
C  1.396389 -2.840913 0.324205
C  -3.343366 -0.942426 0.291338
C  3.431518 -1.011011 -0.058193
C  -2.252845 -2.74915 1.418479
C  2.312623 -3.024538 -0.703378
C  -1.401815 -1.941498 -0.681801
C  1.535562 -1.760152 1.191192
C  -3.282915 -1.819236 1.360536
C  3.33932 -2.109616 -0.895022
C  -2.412328 -0.999167 -0.734955
C  2.544687 -0.834769 0.994838
C  -5.488345 2.796025 -0.90975
C  -4.36197 1.949606 3.522773
C  6.64195 1.694782 -1.817334
C  2.097291 2.876127 -0.875168
H  -2.183992 -3.413844 2.269927
H  2.213612 -3.86341 -1.379911
H  -0.676665 -1.98739 -1.484164
H  0.84089 -1.621732 2.009745
H  -4.020798 -1.77649 2.151164
H  4.045229 -2.242392 -1.703939
H  -2.482169 -0.318403 -1.573104
H  2.643181 0.012903 1.66013
H  -5.300899 2.069041 -1.70072
H  -4.741565 3.58862 -0.960663
H  -6.477141 3.225823 -1.049237
H  -4.756675 2.952147 3.356289
H  -4.85026 1.516256 4.391944
H  -3.288931 2.006018 3.702879
H  7.006683 0.691697 -1.594744
H  6.434965 1.777821 -2.884445
H  7.403419 2.42013 -1.542652
H  1.534569 3.269811 -0.03241
H  2.520949 3.704906 -1.44207
H  1.429148 2.300722 -1.51484
elementType: S P O C H
totalener: -2950.73439623 hartree
nucrepener: 3427.27662556 hartree
electener: -6378.01102179 hartree
twoeener: 4508.41300136 hartree
cpcmener: -0.02895701 hartree
kineticenergy: 2942.57214805 hartree
xcener: -192.748185338583 hartree
chargesum: -0.0000000
charge: -0.071756 -0.453063 -0.448398 0.771185 0.767224 -0.354264 -0.352160 -0.334120 -0.339548 -0.336340 -0.343170 0.036203 0.025121 0.252408 0.275924 -0.151581 -0.128606 -0.113194 -0.111976 -0.166392 -0.196878 -0.196677 -0.198758 -0.115470 -0.117619 -0.114960 -0.110189 0.135433 0.135216 0.144934 0.143939 0.151983 0.144669 0.147773 0.151366 0.125985 0.110566 0.129633 0.126364 0.127980 0.115407 0.126630 0.109520 0.129175 0.127836 0.130696 0.111949
qa: -0.0718 -0.4531 -0.4484 0.7712 0.7672 -0.3543 -0.3522 -0.3341 -0.3395 -0.3363 -0.3432 0.0362 0.0251 0.2524 0.2759 -0.1516 -0.1286 -0.1132 -0.1120 -0.1664 -0.1969 -0.1967 -0.1988 -0.1155 -0.1176 -0.1150 -0.1102 0.1354 0.1352 0.1449 0.1439 0.1520 0.1447 0.1478 0.1514 0.1260 0.1106 0.1296 0.1264 0.1280 0.1154 0.1266 0.1095 0.1292 0.1278 0.1307 0.1119
va: 2.2693 1.9836 1.9889 5.4886 5.4891 2.0998 2.0972 2.1063 2.1109 2.1117 2.1019 3.7240 3.7247 3.7078 3.6937 3.9901 3.9628 3.9056 3.9118 4.0427 4.0401 4.0228 4.0328 3.8442 3.8471 3.8426 3.8338 1.0139 1.0134 0.9949 0.9956 1.0050 1.0085 1.0039 1.0060 0.9859 0.9997 0.9907 0.9868 0.9919 0.9973 0.9861 1.0005 0.9903 0.9921 0.9885 1.0002
dispcorr: -0.024556312 hartree
energy: -2950.758952546761
dipole: -2.52558 1.91845 -0.60713 10.39179 -9.11876 1.27303 1.28484 -0.72700 0.55784
magnitude: 1.51670 au
magnitude: 3.85515 debye
