program: Orca
programVersion: 5.0.2
elementType: S S S P P O O O O O O C C C C C C C C C C C C C C C C H H H H H H H H H H H H H H H H H H H H
charge: 0
multiplicity: 1
keywords: wb97x-d3
keywords: def2-TZVPP
keywords: def2/J RIJCOSX
keywords: DEFGRID2
keywords: scfconv7
keywords: smallprint printgap noloewdin
keywords: NOSOSCF
formula: C16H20O6P2S3
InChI: InChI=1/C16H20O6P2S3/c1-17-23(25,18-2)21-13-5-9-15(10-6-13)27-16-11-7-14(8-12-16)22-24(26,19-3)20-4/h5-12H,1-4H3
47 atoms
S  0.113198 -3.714063 0.184942
S  -4.907756 0.482027 2.700564
S  3.432339 2.153092 -0.091921
P  -4.951314 1.09832 0.887852
P  4.851804 1.218874 -0.972327
O  -4.416646 0.068283 -0.236762
O  4.904837 -0.381305 -0.733223
O  -4.104754 2.397437 0.522632
O  -6.37434 1.465744 0.277935
O  4.901475 1.276236 -2.562101
O  6.343295 1.622056 -0.595803
C  -1.198843 -2.529698 0.063111
C  1.536035 -2.701345 -0.105004
C  -3.33941 -0.771792 -0.088107
C  3.774198 -1.139782 -0.541281
C  -1.059486 -1.215188 0.496875
C  2.507072 -2.584754 0.881553
C  -2.422482 -2.955668 -0.443673
C  1.703292 -2.045414 -1.321382
C  -2.120978 -0.330467 0.407896
C  3.632997 -1.803665 0.66393
C  -3.497705 -2.083217 -0.504049
C  2.816919 -1.255439 -1.540198
C  -4.070919 3.527391 1.402074
C  -7.511562 0.626102 0.502882
C  4.692733 2.509779 -3.258282
C  6.72374 1.849767 0.764933
H  -0.118927 -0.861831 0.898897
H  2.381451 -3.086972 1.831877
H  -2.545293 -3.97107 -0.798972
H  0.958548 -2.141001 -2.100897
H  -1.979726 0.695958 0.719861
H  4.38706 -1.702096 1.433968
H  -4.44932 -2.417892 -0.896885
H  2.942805 -0.749594 -2.48872
H  -3.450995 4.276769 0.916811
H  -3.62972 3.262429 2.362622
H  -5.068165 3.938534 1.560388
H  -7.329185 -0.394338 0.163904
H  -7.785219 0.614581 1.557742
H  -8.328177 1.050302 -0.075623
H  4.762922 2.282272 -4.318826
H  3.70569 2.919001 -3.043055
H  5.455502 3.245047 -3.000172
H  7.793564 2.042531 0.759455
H  6.204029 2.715207 1.175962
H  6.523894 0.977062 1.38799
elementType: S P O C H
totalener: -2950.73660849 hartree
nucrepener: 3323.58058212 hartree
electener: -6274.31719061 hartree
twoeener: 4404.72643117 hartree
cpcmener: -0.03149938 hartree
kineticenergy: 2942.57841185 hartree
xcener: -192.752734756350 hartree
chargesum: -0.0000000
charge: -0.054331 -0.443175 -0.443729 0.752806 0.759337 -0.327734 -0.340486 -0.340660 -0.338991 -0.338223 -0.338046 0.043932 0.042279 0.214191 0.228954 -0.159212 -0.130594 -0.147778 -0.140542 -0.156519 -0.179946 -0.176313 -0.153560 -0.118578 -0.116622 -0.119154 -0.116328 0.147048 0.136648 0.133741 0.148387 0.145787 0.150370 0.147906 0.153654 0.129939 0.114338 0.129275 0.123572 0.112548 0.129346 0.129159 0.113086 0.127996 0.129722 0.112660 0.123838
qa: -0.0543 -0.4432 -0.4437 0.7528 0.7593 -0.3277 -0.3405 -0.3407 -0.3390 -0.3382 -0.3380 0.0439 0.0423 0.2142 0.2290 -0.1592 -0.1306 -0.1478 -0.1405 -0.1565 -0.1799 -0.1763 -0.1536 -0.1186 -0.1166 -0.1192 -0.1163 0.1470 0.1366 0.1337 0.1484 0.1458 0.1504 0.1479 0.1537 0.1299 0.1143 0.1293 0.1236 0.1125 0.1293 0.1292 0.1131 0.1280 0.1297 0.1127 0.1238
va: 2.3303 1.9887 1.9888 5.4902 5.4864 2.1285 2.1138 2.0908 2.1045 2.1022 2.1055 3.7748 3.7122 3.7665 3.7324 3.9477 3.9804 3.9706 3.9709 3.9542 4.0309 4.0163 3.9679 3.8375 3.8481 3.8419 3.8488 0.9956 1.0132 1.0116 0.9972 1.0115 0.9975 1.0008 1.0066 0.9911 0.9989 0.9890 0.9859 0.9988 0.9911 0.9908 0.9992 0.9877 0.9912 0.9990 0.9850
dispcorr: -0.023497396 hartree
energy: -2950.760105888961
dipole: 0.56007 0.02051 0.58058 10.03307 -8.76343 1.26964 -1.89802 1.06163 -0.83639
magnitude: 1.62746 au
magnitude: 4.13666 debye
