program: Orca
programVersion: 5.0.2
elementType: S S S P P O O O O O O C C C C C C C C C C C C C C C C H H H H H H H H H H H H H H H H H H H H
charge: 0
multiplicity: 1
keywords: wb97x-d3
keywords: def2-TZVPP
keywords: def2/J RIJCOSX
keywords: DEFGRID2
keywords: scfconv7
keywords: smallprint printgap noloewdin
keywords: NOSOSCF
formula: C16H20O6P2S3
InChI: InChI=1/C16H20O6P2S3/c1-17-23(25,18-2)21-13-5-9-15(10-6-13)27-16-11-7-14(8-12-16)22-24(26,19-3)20-4/h5-12H,1-4H3
47 atoms
S  0.071935 -3.530055 0.335271
S  -3.941575 1.572663 2.593156
S  3.557579 1.632608 -2.220253
P  -5.122781 1.065899 1.179046
P  5.013429 1.16667 -1.066715
O  -4.438513 0.274331 -0.065094
O  4.972248 -0.324309 -0.441135
O  -5.88275 2.213954 0.378913
O  -6.319318 0.147474 1.671192
O  6.481316 1.199211 -1.68345
O  5.214026 2.019754 0.260817
C  -1.240144 -2.34687 0.225549
C  1.508091 -2.523847 0.100699
C  -3.390154 -0.603829 0.068375
C  3.807238 -1.032531 -0.261686
C  -2.380415 -2.566989 0.990556
C  2.420618 -2.877673 -0.884931
C  -1.192269 -1.251996 -0.632415
C  1.762403 -1.423076 0.915341
C  -3.463356 -1.705571 0.904816
C  3.57751 -2.133963 -1.06549
C  -2.257379 -0.370506 -0.69521
C  2.904498 -0.665582 0.726115
C  -5.171975 3.350858 -0.122963
C  -7.3138 -0.389176 0.786055
C  6.741867 0.658039 -2.982574
C  5.204417 3.450965 0.220847
H  -2.432618 -3.409867 1.668019
H  2.226919 -3.725148 -1.529288
H  -0.321526 -1.068691 -1.248079
H  1.064708 -1.14613 1.695018
H  -4.34753 -1.901237 1.498123
H  4.287648 -2.404563 -1.836205
H  -2.21258 0.490022 -1.350467
H  3.098938 0.190731 1.359344
H  -4.635053 3.86122 0.677203
H  -5.915004 4.025235 -0.540826
H  -4.469336 3.062882 -0.905579
H  -7.887426 -1.106064 1.367535
H  -7.980617 0.394693 0.428776
H  -6.865388 -0.903655 -0.063786
H  6.470866 -0.397294 -3.03685
H  6.202669 1.210739 -3.751847
H  7.811038 0.757707 -3.151734
H  4.27026 3.826248 -0.197068
H  5.298509 3.790762 1.248979
H  6.043462 3.83413 -0.36027
elementType: S P O C H
totalener: -2950.73663696 hartree
nucrepener: 3314.34591944 hartree
electener: -6265.08255640 hartree
twoeener: 4395.31503165 hartree
cpcmener: -0.03322862 hartree
kineticenergy: 2942.57223376 hartree
xcener: -192.751216655919 hartree
chargesum: -0.0000000
charge: -0.041794 -0.424835 -0.444628 0.723493 0.759108 -0.341806 -0.346905 -0.334911 -0.339395 -0.338098 -0.336462 0.042704 0.044710 0.232227 0.226870 -0.151648 -0.135811 -0.143536 -0.152493 -0.155129 -0.176009 -0.190325 -0.150450 -0.111981 -0.119778 -0.116307 -0.116403 0.134895 0.135511 0.148519 0.152479 0.145597 0.152567 0.149026 0.153244 0.108063 0.128631 0.124912 0.127836 0.127762 0.120761 0.123084 0.112483 0.129510 0.110243 0.128807 0.125668
qa: -0.0418 -0.4248 -0.4446 0.7235 0.7591 -0.3418 -0.3469 -0.3349 -0.3394 -0.3381 -0.3365 0.0427 0.0447 0.2322 0.2269 -0.1516 -0.1358 -0.1435 -0.1525 -0.1551 -0.1760 -0.1903 -0.1504 -0.1120 -0.1198 -0.1163 -0.1164 0.1349 0.1355 0.1485 0.1525 0.1456 0.1526 0.1490 0.1532 0.1081 0.1286 0.1249 0.1278 0.1278 0.1208 0.1231 0.1125 0.1295 0.1102 0.1288 0.1257
va: 2.3586 2.0226 1.9881 5.5089 5.4887 2.0599 2.1085 2.0914 2.0977 2.1022 2.1091 3.7666 3.7218 3.7286 3.7251 3.9762 3.9890 3.9154 3.9597 3.9796 4.0337 4.0323 3.9803 3.8455 3.8377 3.8517 3.8450 1.0134 1.0141 0.9934 0.9933 1.0066 0.9948 0.9999 1.0054 1.0008 0.9898 0.9868 0.9892 0.9936 0.9913 0.9841 0.9991 0.9913 0.9998 0.9899 0.9881
dispcorr: -0.023931837 hartree
energy: -2950.760568793772
dipole: -0.34771 0.51632 0.16861 6.63025 -6.14621 0.48404 -7.63452 5.84367 -1.79085
magnitude: 1.86276 au
magnitude: 4.73476 debye
