program: Orca
programVersion: 5.0.2
elementType: S S S P P O O O O O O C C C C C C C C C C C C C C C C H H H H H H H H H H H H H H H H H H H H
charge: 0
multiplicity: 1
keywords: wb97x-d3
keywords: def2-TZVPP
keywords: def2/J RIJCOSX
keywords: DEFGRID2
keywords: scfconv7
keywords: smallprint printgap noloewdin
keywords: NOSOSCF
formula: C16H20O6P2S3
InChI: InChI=1/C16H20O6P2S3/c1-17-23(25,18-2)21-13-5-9-15(10-6-13)27-16-11-7-14(8-12-16)22-24(26,19-3)20-4/h5-12H,1-4H3
47 atoms
S  0.10062 -3.464557 0.348322
S  -4.063788 1.70173 -1.188991
S  4.76031 1.671823 1.724923
P  -5.259052 0.992074 0.128063
P  5.368263 1.176421 -0.016924
O  -5.045751 -0.566284 0.507529
O  4.250115 0.526694 -1.000695
O  -6.814509 1.010071 -0.210239
O  -5.240494 1.641694 1.580703
O  5.926366 2.316077 -0.977727
O  6.570259 0.139287 0.01356
C  -1.408194 -2.541253 0.382827
C  1.302251 -2.218735 -0.020346
C  -3.821825 -1.191107 0.469816
C  3.300608 -0.390603 -0.627951
C  -2.466592 -2.95195 -0.41736
C  2.5738 -2.359026 0.523823
C  -1.57101 -1.453259 1.23701
C  1.041188 -1.155075 -0.879905
C  -3.679046 -2.278777 -0.37229
C  3.581025 -1.458268 0.210445
C  -2.772277 -0.767885 1.27478
C  2.03185 -0.232477 -1.166424
C  -7.288582 0.674194 -1.519037
C  -5.276611 3.064542 1.748436
C  5.189795 3.522539 -1.205604
C  7.220455 -0.32566 -1.180606
H  -2.349014 -3.790047 -1.091903
H  2.793896 -3.173848 1.202004
H  -0.758031 -1.130445 1.874601
H  0.062997 -1.031361 -1.326187
H  -4.502943 -2.593981 -0.99958
H  4.567234 -1.60751 0.629976
H  -2.888721 0.074127 1.944908
H  1.822912 0.600428 -1.825772
H  -6.865721 1.338736 -2.272636
H  -8.368361 0.79704 -1.498633
H  -7.050988 -0.359647 -1.772246
H  -4.458107 3.544711 1.211469
H  -6.22678 3.476067 1.407485
H  -5.166079 3.254413 2.812869
H  4.248746 3.320391 -1.717889
H  4.988882 4.042022 -0.268241
H  5.811115 4.15214 -1.837367
H  7.824199 -1.181206 -0.889334
H  6.50326 -0.641946 -1.938053
H  7.870074 0.446564 -1.590899
elementType: S P O C H
totalener: -2950.73667037 hartree
nucrepener: 3299.51283720 hartree
electener: -6250.24950757 hartree
twoeener: 4380.39671150 hartree
cpcmener: -0.03262545 hartree
kineticenergy: 2942.55431041 hartree
xcener: -192.748960421236 hartree
chargesum: 0.0000000
charge: -0.044273 -0.445306 -0.422417 0.759685 0.720121 -0.338658 -0.328676 -0.338957 -0.336595 -0.333256 -0.339238 0.037624 0.034438 0.222769 0.245388 -0.132458 -0.157416 -0.147710 -0.140097 -0.177730 -0.158575 -0.152611 -0.196011 -0.116774 -0.115614 -0.111114 -0.117728 0.135437 0.134419 0.152614 0.149807 0.150608 0.139097 0.153018 0.148877 0.111440 0.129561 0.125012 0.110128 0.127092 0.129144 0.124822 0.108151 0.127656 0.126815 0.122165 0.125328
qa: -0.0443 -0.4453 -0.4224 0.7597 0.7201 -0.3387 -0.3287 -0.3390 -0.3366 -0.3333 -0.3392 0.0376 0.0344 0.2228 0.2454 -0.1325 -0.1574 -0.1477 -0.1401 -0.1777 -0.1586 -0.1526 -0.1960 -0.1168 -0.1156 -0.1111 -0.1177 0.1354 0.1344 0.1526 0.1498 0.1506 0.1391 0.1530 0.1489 0.1114 0.1296 0.1250 0.1101 0.1271 0.1291 0.1248 0.1082 0.1277 0.1268 0.1222 0.1253
va: 2.3548 1.9881 2.0283 5.4856 5.5107 2.1171 2.0771 2.1053 2.1054 2.0945 2.0910 3.7276 3.7776 3.7432 3.7440 3.9831 3.9843 3.9678 3.9160 4.0299 3.9560 3.9599 4.0133 3.8465 3.8408 3.8456 3.8401 1.0139 1.0139 0.9935 0.9918 0.9979 1.0168 1.0072 1.0014 1.0004 0.9910 0.9849 1.0003 0.9886 0.9900 0.9875 1.0002 0.9896 0.9895 0.9923 0.9931
dispcorr: -0.023668749 hartree
energy: -2950.760339117850
dipole: -2.01031 1.26607 -0.74424 6.72124 -6.15646 0.56478 -7.72116 5.92542 -1.79574
magnitude: 2.02424 au
magnitude: 5.14520 debye
