program: Orca
programVersion: 5.0.2
elementType: S S S P P O O O O O O C C C C C C C C C C C C C C C C H H H H H H H H H H H H H H H H H H H H
charge: 0
multiplicity: 1
keywords: wb97x-d3
keywords: def2-TZVPP
keywords: def2/J RIJCOSX
keywords: DEFGRID2
keywords: scfconv7
keywords: smallprint printgap noloewdin
keywords: NOSOSCF
formula: C16H20O6P2S3
InChI: InChI=1/C16H20O6P2S3/c1-17-23(25,18-2)21-13-5-9-15(10-6-13)27-16-11-7-14(8-12-16)22-24(26,19-3)20-4/h5-12H,1-4H3
47 atoms
S  0.084048 -3.422097 0.384802
S  -4.275262 1.342175 2.769212
S  3.743274 1.730293 -2.286966
P  -5.323229 0.963758 1.217699
P  5.155253 1.159587 -1.126566
O  -4.534057 0.252553 -0.012868
O  5.038406 -0.351126 -0.562315
O  -5.999005 2.182086 0.446264
O  -6.572462 0.03106 1.518236
O  6.635893 1.147654 -1.709138
O  5.36843 1.951991 0.236312
C  -1.249226 -2.261367 0.286508
C  1.513724 -2.426576 0.076454
C  -3.45659 -0.587756 0.129286
C  3.84602 -1.004153 -0.359194
C  -2.385348 -2.520958 1.047155
C  2.394197 -2.818398 -0.924987
C  -1.232196 -1.158651 -0.562191
C  1.812125 -1.315751 0.861754
C  -3.495971 -1.69577 0.960588
C  3.566099 -2.109465 -1.142807
C  -2.326206 -0.312088 -0.624552
C  2.9703 -0.592527 0.635766
C  -5.235195 3.339467 0.090968
C  -7.432166 -0.469843 0.483781
C  6.916534 0.667226 -3.026896
C  5.407756 3.382092 0.268782
H  -2.413874 -3.369957 1.718842
H  2.165844 -3.673498 -1.547894
H  -0.365687 -0.944174 -1.174002
H  1.140289 -1.00813 1.652661
H  -4.378099 -1.925631 1.54498
H  4.253785 -2.413874 -1.921381
H  -2.306081 0.5533 -1.274877
H  3.201435 0.266668 1.252662
H  -4.463544 3.094483 -0.639895
H  -4.772373 3.788854 0.970075
H  -5.929989 4.050016 -0.349199
H  -6.868438 -0.99215 -0.28913
H  -8.109135 -1.173849 0.960819
H  -8.013899 0.333794 0.03311
H  6.634874 -0.380902 -3.136321
H  6.400352 1.26293 -3.779737
H  7.990239 0.762186 -3.169144
H  6.258986 3.766358 -0.294158
H  4.486341 3.810341 -0.126073
H  5.515386 3.664935 1.312972
elementType: S P O C H
totalener: -2950.73662513 hartree
nucrepener: 3293.61344248 hartree
electener: -6244.35006761 hartree
twoeener: 4374.46831846 hartree
cpcmener: -0.03298854 hartree
kineticenergy: 2942.55034448 hartree
xcener: -192.748284554184 hartree
chargesum: 0.0000000
charge: -0.037972 -0.423308 -0.443503 0.724235 0.754846 -0.343378 -0.342062 -0.334232 -0.339748 -0.337322 -0.335952 0.046373 0.039760 0.239672 0.224417 -0.153211 -0.131586 -0.150201 -0.156458 -0.156151 -0.178002 -0.191589 -0.146477 -0.112811 -0.117579 -0.115891 -0.116336 0.134630 0.136114 0.149714 0.154011 0.142151 0.151194 0.149096 0.152583 0.124569 0.108101 0.128693 0.119272 0.127414 0.125909 0.124264 0.111950 0.129114 0.125960 0.110929 0.128796
qa: -0.0380 -0.4233 -0.4435 0.7242 0.7548 -0.3434 -0.3421 -0.3342 -0.3397 -0.3373 -0.3360 0.0464 0.0398 0.2397 0.2244 -0.1532 -0.1316 -0.1502 -0.1565 -0.1562 -0.1780 -0.1916 -0.1465 -0.1128 -0.1176 -0.1159 -0.1163 0.1346 0.1361 0.1497 0.1540 0.1422 0.1512 0.1491 0.1526 0.1246 0.1081 0.1287 0.1193 0.1274 0.1259 0.1243 0.1120 0.1291 0.1260 0.1109 0.1288
va: 2.3704 2.0236 1.9899 5.5049 5.4934 2.0576 2.1127 2.0927 2.0959 2.1041 2.1067 3.7825 3.7355 3.7260 3.7347 3.9652 3.9831 3.9255 3.9714 3.9722 4.0324 4.0298 3.9743 3.8477 3.8414 3.8488 3.8443 1.0128 1.0136 0.9929 0.9928 1.0103 0.9965 1.0002 1.0066 0.9863 1.0005 0.9900 0.9916 0.9891 0.9935 0.9846 0.9995 0.9910 0.9881 0.9994 0.9899
dispcorr: -0.023658660 hartree
energy: -2950.760283794777
dipole: 0.58964 -0.16366 0.42598 6.90203 -6.31080 0.59123 -7.82931 5.97140 -1.85791
magnitude: 1.99571 au
magnitude: 5.07269 debye
