program: Orca
programVersion: 5.0.2
elementType: S S S P P O O O O O O C C C C C C C C C C C C C C C C H H H H H H H H H H H H H H H H H H H H
charge: 0
multiplicity: 1
keywords: wb97x-d3
keywords: def2-TZVPP
keywords: def2/J RIJCOSX
keywords: DEFGRID2
keywords: scfconv7
keywords: smallprint printgap noloewdin
keywords: NOSOSCF
formula: C16H20O6P2S3
InChI: InChI=1/C16H20O6P2S3/c1-17-23(25,18-2)21-13-5-9-15(10-6-13)27-16-11-7-14(8-12-16)22-24(26,19-3)20-4/h5-12H,1-4H3
47 atoms
S  -0.074158 -3.759373 0.008167
S  -3.368608 2.192183 0.522787
S  5.228065 0.904145 1.689831
P  -4.976336 1.227529 0.135567
P  5.010364 1.155386 -0.196543
O  -4.911605 -0.377497 0.332331
O  4.461074 -0.105779 -1.042294
O  -5.547823 1.306295 -1.347234
O  -6.271194 1.581825 0.991576
O  3.997457 2.282479 -0.682619
O  6.316679 1.50041 -1.037053
C  -1.493516 -2.70282 0.087256
C  1.239582 -2.606904 -0.282304
C  -3.76223 -1.123249 0.2287
C  3.38624 -0.900102 -0.731613
C  -1.865904 -1.913763 -0.998337
C  1.257687 -1.335953 0.280539
C  -2.274835 -2.704201 1.236168
C  2.312517 -3.018114 -1.067095
C  -2.993259 -1.113845 -0.928041
C  2.317687 -0.47445 0.04635
C  -3.414598 -1.916482 1.307989
C  3.390366 -2.174291 -1.278267
C  -5.617305 2.556611 -2.042576
C  -6.189751 1.765829 2.40873
C  3.90317 3.537431 0.00153
C  7.572441 0.873085 -0.753442
H  -1.27378 -1.915295 -1.904341
H  0.438554 -0.995353 0.900547
H  -1.991268 -3.309128 2.087532
H  2.314299 -3.999136 -1.525361
H  -3.278807 -0.510426 -1.780289
H  2.283584 0.516138 0.478972
H  -4.021473 -1.913264 2.204288
H  4.22331 -2.499344 -1.888645
H  -5.969442 2.333672 -3.046403
H  -4.636002 3.027711 -2.103454
H  -6.31837 3.238046 -1.560241
H  -5.833421 0.863308 2.906914
H  -5.534692 2.600474 2.658486
H  -7.197737 1.985925 2.750989
H  3.619104 3.395948 1.044251
H  4.843439 4.087153 -0.047574
H  3.129889 4.108123 -0.506037
H  7.528467 -0.200672 -0.937674
H  8.300321 1.320371 -1.425502
H  7.877753 1.052407 0.277533
elementType: S P O C H
totalener: -2950.73565228 hartree
nucrepener: 3315.37222907 hartree
electener: -6266.10788136 hartree
twoeener: 4396.42349540 hartree
cpcmener: -0.03097364 hartree
kineticenergy: 2942.55277165 hartree
xcener: -192.750165464408 hartree
chargesum: -0.0000000
charge: -0.053684 -0.442806 -0.443196 0.757576 0.752235 -0.337137 -0.314202 -0.337641 -0.337738 -0.337927 -0.340671 0.037529 0.034655 0.232665 0.253474 -0.139799 -0.175724 -0.132658 -0.140184 -0.156243 -0.155063 -0.176409 -0.193003 -0.116953 -0.117378 -0.115075 -0.117815 0.149160 0.150123 0.135485 0.133247 0.148706 0.128061 0.149717 0.147584 0.129081 0.110896 0.128056 0.124356 0.111855 0.129510 0.111561 0.129395 0.129619 0.125616 0.128974 0.112174
qa: -0.0537 -0.4428 -0.4432 0.7576 0.7522 -0.3371 -0.3142 -0.3376 -0.3377 -0.3379 -0.3407 0.0375 0.0347 0.2327 0.2535 -0.1398 -0.1757 -0.1327 -0.1402 -0.1562 -0.1551 -0.1764 -0.1930 -0.1170 -0.1174 -0.1151 -0.1178 0.1492 0.1501 0.1355 0.1332 0.1487 0.1281 0.1497 0.1476 0.1291 0.1109 0.1281 0.1244 0.1119 0.1295 0.1116 0.1294 0.1296 0.1256 0.1290 0.1122
va: 2.3361 1.9892 1.9897 5.4861 5.4979 2.1181 2.1622 2.0999 2.1059 2.0851 2.1101 3.7192 3.7856 3.7404 3.7531 3.9672 3.9808 3.9862 3.9715 3.9528 3.9396 4.0231 4.0078 3.8410 3.8500 3.8371 3.8440 0.9961 0.9938 1.0140 1.0118 1.0081 1.0221 0.9987 1.0037 0.9903 1.0005 0.9883 0.9845 0.9994 0.9910 0.9994 0.9890 0.9908 0.9861 0.9905 0.9997
dispcorr: -0.023131806 hartree
energy: -2950.758784089954
dipole: -1.46719 0.75196 -0.71523 10.14623 -8.86938 1.27685 -1.14216 0.57303 -0.56913
magnitude: 1.57029 au
magnitude: 3.99137 debye
