program: Orca
programVersion: 5.0.2
elementType: S S S P P O O O O O O C C C C C C C C C C C C C C C C H H H H H H H H H H H H H H H H H H H H
charge: 0
multiplicity: 1
keywords: wb97x-d3
keywords: def2-TZVPP
keywords: def2/J RIJCOSX
keywords: DEFGRID2
keywords: scfconv7
keywords: smallprint printgap noloewdin
keywords: NOSOSCF
formula: C16H20O6P2S3
InChI: InChI=1/C16H20O6P2S3/c1-17-23(25,18-2)21-13-5-9-15(10-6-13)27-16-11-7-14(8-12-16)22-24(26,19-3)20-4/h5-12H,1-4H3
47 atoms
S  0.005966 -4.211865 -0.090662
S  -2.918466 1.314699 2.886673
S  2.094621 1.762668 -1.926529
P  -3.834305 1.236374 1.204139
P  3.77036 1.472959 -1.040804
O  -4.296795 -0.231663 0.695811
O  4.177193 -0.070958 -0.774696
O  -3.054301 1.873411 -0.034315
O  -5.278589 1.889861 1.097493
O  5.083726 2.005318 -1.764829
O  3.946455 2.076925 0.42119
C  -1.357228 -3.090353 0.116702
C  1.30003 -3.003853 -0.253141
C  -3.335181 -1.20127 0.496226
C  3.228113 -1.048497 -0.575626
C  -2.024123 -3.017802 1.332739
C  2.139079 -3.029403 -1.359513
C  -1.723621 -2.245558 -0.927036
C  1.462832 -2.015105 0.713609
C  -3.019852 -2.070146 1.526724
C  3.109506 -2.049937 -1.522099
C  -2.708015 -1.291543 -0.738409
C  2.418731 -1.029106 0.551068
C  -1.636572 2.078264 -0.057003
C  -5.513332 3.197572 1.631809
C  5.266232 1.831532 -3.174027
C  3.492705 3.400645 0.726951
H  -1.748328 -3.676342 2.145897
H  2.023192 -3.79354 -2.117046
H  -1.221719 -2.310887 -1.883765
H  0.829046 -1.995338 1.590892
H  -3.529246 -1.998955 2.478444
H  3.750528 -2.054865 -2.394353
H  -2.984175 -0.624219 -1.544534
H  2.531881 -0.257502 1.301882
H  -1.297245 2.599615 0.837607
H  -1.430094 2.692009 -0.930212
H  -1.103653 1.131943 -0.146235
H  -6.567875 3.409758 1.477799
H  -5.292701 3.232059 2.698794
H  -4.918319 3.95005 1.113435
H  5.238965 0.777365 -3.452441
H  4.507165 2.375016 -3.736242
H  6.246934 2.235449 -3.411731
H  4.000392 4.146443 0.114852
H  2.415304 3.48672 0.586347
H  3.733152 3.575836 1.772361
elementType: S P O C H
totalener: -2950.73330126 hartree
nucrepener: 3484.19008183 hartree
electener: -6434.92338309 hartree
twoeener: 4564.74399059 hartree
cpcmener: -0.02959078 hartree
kineticenergy: 2942.57003969 hartree
xcener: -192.748317600432 hartree
chargesum: 0.0000000
charge: -0.078796 -0.449338 -0.448853 0.757603 0.766750 -0.345319 -0.344359 -0.342917 -0.333273 -0.337658 -0.339335 0.039100 0.054644 0.261378 0.220983 -0.141167 -0.151635 -0.102410 -0.146614 -0.181745 -0.168137 -0.210130 -0.157225 -0.083869 -0.123329 -0.117205 -0.117906 0.138226 0.134012 0.141732 0.145714 0.145977 0.150827 0.158499 0.153168 0.114793 0.130068 0.104482 0.129338 0.112993 0.125266 0.124045 0.112531 0.129916 0.127597 0.111902 0.129676
qa: -0.0788 -0.4493 -0.4489 0.7576 0.7667 -0.3453 -0.3444 -0.3429 -0.3333 -0.3377 -0.3393 0.0391 0.0546 0.2614 0.2210 -0.1412 -0.1516 -0.1024 -0.1466 -0.1817 -0.1681 -0.2101 -0.1572 -0.0839 -0.1233 -0.1172 -0.1179 0.1382 0.1340 0.1417 0.1457 0.1460 0.1508 0.1585 0.1532 0.1148 0.1301 0.1045 0.1293 0.1130 0.1253 0.1240 0.1125 0.1299 0.1276 0.1119 0.1297
va: 2.2484 1.9875 1.9792 5.4980 5.4714 2.1118 2.1100 2.0779 2.1203 2.1034 2.1039 3.7029 3.7250 3.7088 3.7236 3.9614 3.9870 3.9090 3.9499 4.0232 4.0203 3.9759 3.9756 3.8234 3.8494 3.8492 3.8457 1.0118 1.0137 0.9995 0.9964 1.0061 0.9960 0.9991 1.0069 1.0076 0.9922 0.9894 0.9909 0.9994 0.9861 0.9849 0.9993 0.9912 0.9879 0.9977 0.9912
dispcorr: -0.026222361 hartree
energy: -2950.759523623482
dipole: 4.97144 -3.85441 1.11704 13.21226 -11.43865 1.77361 -3.65897 2.75180 -0.90717
magnitude: 2.28395 au
magnitude: 5.80533 debye
