program: Orca
programVersion: 5.0.2
elementType: S S S P P O O O O O O C C C C C C C C C C C C C C C C H H H H H H H H H H H H H H H H H H H H
charge: 0
multiplicity: 1
keywords: wb97x-d3
keywords: def2-TZVPP
keywords: def2/J RIJCOSX
keywords: DEFGRID2
keywords: scfconv7
keywords: smallprint printgap noloewdin
keywords: NOSOSCF
formula: C16H20O6P2S3
InChI: InChI=1/C16H20O6P2S3/c1-17-23(25,18-2)21-13-5-9-15(10-6-13)27-16-11-7-14(8-12-16)22-24(26,19-3)20-4/h5-12H,1-4H3
47 atoms
S  -0.034424 -3.056826 0.593193
S  -4.284418 2.201441 1.050677
S  6.553518 -0.544277 0.360561
P  -5.653039 0.966496 0.530735
P  5.716682 0.771201 -0.751475
O  -5.174042 -0.285531 -0.375739
O  4.127312 0.981212 -0.550597
O  -6.853681 1.525791 -0.35187
O  -6.436125 0.208579 1.691474
O  6.217463 2.274967 -0.603694
O  5.777992 0.564553 -2.328711
C  -1.541792 -2.176086 0.292897
C  1.198134 -1.836462 0.23852
C  -3.968839 -0.914814 -0.140003
C  3.201608 0.002378 -0.294758
C  -1.673365 -1.246461 -0.735062
C  1.234938 -0.624538 0.924257
C  -2.642259 -2.480451 1.087936
C  2.17655 -2.119622 -0.705514
C  -2.881744 -0.602211 -0.9404
C  2.229851 0.296729 0.653414
C  -3.861387 -1.857531 0.867922
C  3.187111 -1.206263 -0.972446
C  -6.60152 2.376252 -1.47582
C  -6.849099 0.903977 2.873241
C  6.512938 2.829716 0.682687
C  7.009866 0.234565 -2.980157
H  -0.833384 -1.008561 -1.37464
H  0.485771 -0.39364 1.670638
H  -2.554934 -3.197397 1.894582
H  2.152137 -3.053754 -1.251357
H  -2.980897 0.130659 -1.730939
H  2.257913 1.242108 1.180182
H  -4.714231 -2.104053 1.487006
H  3.925106 -1.439318 -1.72861
H  -6.096541 3.29265 -1.169226
H  -7.57059 2.62611 -1.900545
H  -6.002296 1.867245 -2.23171
H  -7.345453 0.172232 3.505548
H  -5.99183 1.316077 3.4054
H  -7.55017 1.705185 2.637199
H  5.642732 2.801098 1.33934
H  7.34164 2.302065 1.154752
H  6.796364 3.865814 0.514897
H  7.74614 1.029878 -2.860682
H  7.419129 -0.70061 -2.597017
H  6.780445 0.118524 -4.036393
elementType: S P O C H
totalener: -2950.73685880 hartree
nucrepener: 3263.83827250 hartree
electener: -6214.57513130 hartree
twoeener: 4344.87591582 hartree
cpcmener: -0.03105071 hartree
kineticenergy: 2942.55304080 hartree
xcener: -192.747688816438 hartree
chargesum: -0.0000000
charge: -0.047185 -0.447848 -0.441065 0.766361 0.750119 -0.354218 -0.322048 -0.337102 -0.339753 -0.339478 -0.336435 0.043401 0.027116 0.228877 0.240923 -0.144706 -0.125869 -0.156536 -0.144217 -0.188910 -0.179836 -0.160547 -0.161239 -0.115841 -0.118434 -0.116649 -0.116237 0.153883 0.149875 0.133335 0.135331 0.149705 0.150083 0.154337 0.142633 0.110630 0.129770 0.125216 0.127819 0.113144 0.126841 0.124761 0.112608 0.129085 0.127980 0.111033 0.129287
qa: -0.0472 -0.4478 -0.4411 0.7664 0.7501 -0.3542 -0.3220 -0.3371 -0.3398 -0.3395 -0.3364 0.0434 0.0271 0.2289 0.2409 -0.1447 -0.1259 -0.1565 -0.1442 -0.1889 -0.1798 -0.1605 -0.1612 -0.1158 -0.1184 -0.1166 -0.1162 0.1539 0.1499 0.1333 0.1353 0.1497 0.1501 0.1543 0.1426 0.1106 0.1298 0.1252 0.1278 0.1131 0.1268 0.1248 0.1126 0.1291 0.1280 0.1110 0.1293
va: 2.3447 1.9886 1.9920 5.4916 5.4939 2.1004 2.1378 2.1061 2.1102 2.1040 2.0957 3.7650 3.7386 3.7261 3.7629 3.9014 3.9366 3.9857 4.0247 4.0168 3.9885 4.0415 3.9725 3.8460 3.8466 3.8461 3.8396 0.9893 0.9937 1.0136 1.0159 0.9994 1.0009 1.0050 1.0141 1.0001 0.9906 0.9861 0.9910 0.9991 0.9864 0.9855 0.9992 0.9913 0.9892 1.0001 0.9902
dispcorr: -0.023144970 hartree
energy: -2950.760003772421
dipole: -1.02848 0.61514 -0.41334 8.38361 -7.07798 1.30563 -2.13428 1.39790 -0.73638
magnitude: 1.55492 au
magnitude: 3.95229 debye
