program: Orca
programVersion: 5.0.2
elementType: S S S P P O O O O O O C C C C C C C C C C C C C C C C H H H H H H H H H H H H H H H H H H H H
charge: 0
multiplicity: 1
keywords: wb97x-d3
keywords: def2-TZVPP
keywords: def2/J RIJCOSX
keywords: DEFGRID2
keywords: scfconv7
keywords: smallprint printgap noloewdin
keywords: NOSOSCF
formula: C16H20O6P2S3
InChI: InChI=1/C16H20O6P2S3/c1-17-23(25,18-2)21-13-5-9-15(10-6-13)27-16-11-7-14(8-12-16)22-24(26,19-3)20-4/h5-12H,1-4H3
47 atoms
S  -0.033589 -3.555647 0.098916
S  -3.698988 2.048923 -0.686723
S  4.636284 1.142023 1.606797
P  -5.150311 1.073415 0.093572
P  5.236471 1.010725 -0.207173
O  -4.745124 -0.127281 1.100901
O  4.205159 0.343788 -1.259342
O  -6.135089 0.308477 -0.894192
O  -6.172646 1.881256 1.006112
O  5.594071 2.367977 -0.959256
O  6.5358 0.138795 -0.498825
C  -1.436623 -2.519145 0.402109
C  1.213885 -2.362353 -0.300459
C  -3.652382 -0.930446 0.854517
C  3.238575 -0.573427 -0.919802
C  -1.38411 -1.502726 1.353252
C  0.929458 -1.203357 -1.017279
C  -2.613235 -2.748241 -0.299352
C  2.52539 -2.627614 0.078843
C  -2.485698 -0.694373 1.566428
C  1.936378 -0.299447 -1.307173
C  -3.732128 -1.959597 -0.067524
C  3.544055 -1.742825 -0.242804
C  -6.523728 0.874712 -2.150673
C  -5.709284 2.846613 1.955975
C  4.743172 3.513488 -0.844502
C  7.708877 0.282745 0.31052
H  -0.476567 -1.32567 1.91585
H  -0.080715 -0.985678 -1.338537
H  -2.661686 -3.534099 -1.042063
H  2.76475 -3.52311 0.638629
H  -2.443879 0.109541 2.290006
H  1.710286 0.612672 -1.84483
H  -4.64835 -2.145424 -0.612574
H  4.561311 -1.972011 0.047478
H  -7.084205 1.799447 -2.012541
H  -7.162165 0.140225 -2.63516
H  -5.65488 1.066225 -2.780143
H  -6.594192 3.270508 2.423624
H  -5.08837 2.38153 2.722372
H  -5.14625 3.640642 1.465368
H  3.73669 3.299354 -1.206393
H  4.690964 3.860407 0.187638
H  5.184128 4.290988 -1.463013
H  7.489869 0.082092 1.359589
H  8.426936 -0.448821 -0.050963
H  8.136153 1.281206 0.21375
elementType: S P O C H
totalener: -2950.73632228 hartree
nucrepener: 3318.81044556 hartree
electener: -6269.54676784 hartree
twoeener: 4399.96981352 hartree
cpcmener: -0.03087897 hartree
kineticenergy: 2942.57041977 hartree
xcener: -192.750805736675 hartree
chargesum: -0.0000000
charge: -0.044817 -0.446455 -0.443504 0.764285 0.756730 -0.350829 -0.337011 -0.339400 -0.336943 -0.339073 -0.337909 0.042786 0.040638 0.234316 0.222569 -0.139494 -0.143962 -0.142954 -0.152728 -0.177119 -0.178701 -0.163469 -0.157622 -0.117107 -0.115772 -0.117624 -0.116600 0.152374 0.147042 0.136679 0.134852 0.150482 0.149521 0.155083 0.144431 0.127499 0.128237 0.113265 0.129676 0.125788 0.110831 0.123964 0.112374 0.129332 0.110737 0.128873 0.126731
qa: -0.0448 -0.4465 -0.4435 0.7643 0.7567 -0.3508 -0.3370 -0.3394 -0.3369 -0.3391 -0.3379 0.0428 0.0406 0.2343 0.2226 -0.1395 -0.1440 -0.1430 -0.1527 -0.1771 -0.1787 -0.1635 -0.1576 -0.1171 -0.1158 -0.1176 -0.1166 0.1524 0.1470 0.1367 0.1349 0.1505 0.1495 0.1551 0.1444 0.1275 0.1282 0.1133 0.1297 0.1258 0.1108 0.1240 0.1124 0.1293 0.1107 0.1289 0.1267
va: 2.3479 1.9885 1.9883 5.4916 5.4863 2.1029 2.1183 2.1088 2.1066 2.1043 2.0982 3.7210 3.7601 3.7264 3.7458 3.9290 3.9096 4.0018 3.9832 4.0014 4.0064 4.0350 3.9746 3.8435 3.8451 3.8507 3.8427 0.9930 0.9945 1.0139 1.0132 0.9982 1.0000 1.0048 1.0101 0.9865 0.9910 0.9991 0.9907 0.9855 1.0001 0.9847 0.9992 0.9911 1.0001 0.9903 0.9889
dispcorr: -0.023561103 hartree
energy: -2950.759883380228
dipole: -0.41204 0.00289 -0.40914 9.25505 -8.13162 1.12343 -1.41284 1.06516 -0.34769
magnitude: 1.24515 au
magnitude: 3.16491 debye
