program: Orca
programVersion: 5.0.2
elementType: S S S P P O O O O O O C C C C C C C C C C C C C C C C H H H H H H H H H H H H H H H H H H H H
charge: 0
multiplicity: 1
keywords: wb97x-d3
keywords: def2-TZVPP
keywords: def2/J RIJCOSX
keywords: DEFGRID2
keywords: scfconv7
keywords: smallprint printgap noloewdin
keywords: NOSOSCF
formula: C16H20O6P2S3
InChI: InChI=1/C16H20O6P2S3/c1-17-23(25,18-2)21-13-5-9-15(10-6-13)27-16-11-7-14(8-12-16)22-24(26,19-3)20-4/h5-12H,1-4H3
47 atoms
S  -0.018425 -2.998718 0.65045
S  -4.387043 2.251329 1.00177
S  6.504011 -0.558998 0.408604
P  -5.707674 0.956365 0.505437
P  5.735524 0.755232 -0.752789
O  -5.187028 -0.304599 -0.362981
O  4.144251 1.00342 -0.605253
O  -6.915288 1.449227 -0.406423
O  -6.474939 0.208885 1.683241
O  6.271876 2.247277 -0.616246
O  5.83418 0.516576 -2.323163
C  -1.530933 -2.131587 0.343247
C  1.206357 -1.784636 0.255251
C  -3.971618 -0.904314 -0.108172
C  3.208023 0.03918 -0.329763
C  -1.665342 -1.197807 -0.680543
C  1.243784 -0.554838 0.908059
C  -2.633351 -2.452071 1.129222
C  2.179621 -2.090815 -0.686694
C  -2.880797 -0.570278 -0.894736
C  2.23757 0.359566 0.610643
C  -3.859192 -1.845935 0.900049
C  3.189146 -1.184575 -0.979326
C  -6.682452 2.275332 -1.552388
C  -6.857105 0.903259 2.876016
C  6.555211 2.815166 0.667332
C  7.079265 0.166577 -2.93852
H  -0.823431 -0.944749 -1.311592
H  0.496075 -0.304607 1.649617
H  -2.543273 -3.170805 1.934044
H  2.152882 -3.03766 -1.210034
H  -2.982567 0.163935 -1.683661
H  2.266934 1.317626 1.113768
H  -4.714205 -2.106581 1.510269
H  3.924336 -1.436271 -1.73222
H  -6.084987 1.753877 -2.300949
H  -6.184151 3.204075 -1.27344
H  -7.657802 2.505159 -1.973712
H  -7.329764 0.168702 3.522794
H  -5.987556 1.321135 3.382652
H  -7.569549 1.699728 2.660069
H  5.666449 2.835381 1.298769
H  7.347104 2.263084 1.173214
H  6.886731 3.834617 0.487812
H  6.868626 0.00017 -3.99181
H  7.806227 0.973288 -2.842702
H  7.489504 -0.746495 -2.50621
elementType: S P O C H
totalener: -2950.73683363 hartree
nucrepener: 3261.81439935 hartree
electener: -6212.55123297 hartree
twoeener: 4342.84821220 hartree
cpcmener: -0.03101279 hartree
kineticenergy: 2942.56626143 hartree
xcener: -192.750504231517 hartree
chargesum: -0.0000000
charge: -0.044297 -0.448571 -0.441443 0.767441 0.752197 -0.354328 -0.325244 -0.337212 -0.340883 -0.339699 -0.335952 0.044416 0.032752 0.229828 0.237119 -0.146191 -0.134130 -0.157255 -0.144635 -0.190049 -0.175360 -0.161452 -0.160212 -0.115439 -0.118299 -0.116815 -0.114917 0.154244 0.150926 0.133288 0.135683 0.149359 0.150355 0.153574 0.143638 0.125233 0.110178 0.129795 0.127829 0.113354 0.127648 0.125218 0.112481 0.129222 0.129020 0.127791 0.109795
qa: -0.0443 -0.4486 -0.4414 0.7674 0.7522 -0.3543 -0.3252 -0.3372 -0.3409 -0.3397 -0.3360 0.0444 0.0328 0.2298 0.2371 -0.1462 -0.1341 -0.1573 -0.1446 -0.1900 -0.1754 -0.1615 -0.1602 -0.1154 -0.1183 -0.1168 -0.1149 0.1542 0.1509 0.1333 0.1357 0.1494 0.1504 0.1536 0.1436 0.1252 0.1102 0.1298 0.1278 0.1134 0.1276 0.1252 0.1125 0.1292 0.1290 0.1278 0.1098
va: 2.3531 1.9883 1.9917 5.4917 5.4921 2.1002 2.1343 2.1060 2.1094 2.1048 2.0983 3.7712 3.7392 3.7260 3.7661 3.9021 3.9421 3.9833 4.0244 4.0195 3.9877 4.0458 3.9672 3.8451 3.8452 3.8456 3.8395 0.9892 0.9932 1.0131 1.0156 1.0002 1.0005 1.0049 1.0134 0.9864 1.0003 0.9903 0.9912 0.9992 0.9861 0.9854 0.9997 0.9913 0.9899 0.9894 1.0007
dispcorr: -0.023109082 hartree
energy: -2950.759942709285
dipole: -0.73082 0.42243 -0.30840 8.04300 -6.80146 1.24154 -2.14862 1.41679 -0.73184
magnitude: 1.47381 au
magnitude: 3.74613 debye
