program: Orca
programVersion: 5.0.2
elementType: S S S P P O O O O O O C C C C C C C C C C C C C C C C H H H H H H H H H H H H H H H H H H H H
charge: 0
multiplicity: 1
keywords: wb97x-d3
keywords: def2-TZVPP
keywords: def2/J RIJCOSX
keywords: DEFGRID2
keywords: scfconv7
keywords: smallprint printgap noloewdin
keywords: NOSOSCF
formula: C16H20O6P2S3
InChI: InChI=1/C16H20O6P2S3/c1-17-23(25,18-2)21-13-5-9-15(10-6-13)27-16-11-7-14(8-12-16)22-24(26,19-3)20-4/h5-12H,1-4H3
47 atoms
S  0.040237 -3.083911 0.884939
S  -4.13478 2.249819 0.438652
S  6.375941 -0.177612 0.621878
P  -5.550537 0.959837 0.439696
P  5.616598 0.816851 -0.827116
O  -5.182672 -0.502252 -0.147891
O  4.005883 0.943933 -0.84591
O  -6.853858 1.300541 -0.408328
O  -6.173377 0.556471 1.848355
O  6.025588 2.34975 -0.958853
O  5.87763 0.288762 -2.306367
C  -1.498844 -2.266564 0.565319
C  1.216094 -1.867258 0.362302
C  -3.956982 -1.083707 0.102475
C  3.126853 -0.02746 -0.434749
C  -2.518634 -2.382445 1.50314
C  1.171272 -0.56069 0.841903
C  -1.726327 -1.566243 -0.616798
C  2.232604 -2.244656 -0.505504
C  -3.755562 -1.79828 1.270005
C  2.120429 0.360809 0.438571
C  -2.948813 -0.958173 -0.841145
C  3.197578 -1.329399 -0.901693
C  -6.755312 1.894591 -1.706846
C  -6.470083 1.553399 2.832589
C  6.192092 3.175163 0.198629
C  7.186879 -0.126091 -2.712008
H  -2.353646 -2.918618 2.429027
H  0.393706 -0.254458 1.529845
H  -0.947162 -1.479101 -1.362951
H  2.273918 -3.254771 -0.891691
H  -4.547953 -1.894662 2.000941
H  2.082927 1.378957 0.804223
H  -3.12243 -0.402459 -1.753516
H  3.969173 -1.636185 -1.595563
H  -6.243183 1.234135 -2.406477
H  -6.234085 2.85036 -1.662966
H  -7.772639 2.057017 -2.051503
H  -6.864896 1.026776 3.697069
H  -5.571656 2.097905 3.122526
H  -7.220023 2.256671 2.47068
H  6.468463 4.161805 -0.163357
H  5.266607 3.251245 0.769795
H  6.984655 2.793393 0.841697
H  7.890692 0.705815 -2.686839
H  7.55661 -0.933336 -2.080068
H  7.095854 -0.484928 -3.733461
elementType: S P O C H
totalener: -2950.73665435 hartree
nucrepener: 3273.70717970 hartree
electener: -6224.44383404 hartree
twoeener: 4354.82971079 hartree
cpcmener: -0.03097122 hartree
kineticenergy: 2942.57451380 hartree
xcener: -192.751238054598 hartree
chargesum: -0.0000000
charge: -0.048801 -0.448078 -0.442576 0.767366 0.754072 -0.354608 -0.328844 -0.337377 -0.338701 -0.339789 -0.338422 0.032269 0.030580 0.239456 0.228481 -0.148307 -0.125115 -0.132815 -0.147763 -0.166735 -0.182413 -0.188237 -0.156781 -0.116117 -0.118487 -0.116671 -0.117808 0.134654 0.149723 0.152423 0.135153 0.152848 0.150092 0.149385 0.147691 0.125993 0.111848 0.129802 0.128155 0.113003 0.125328 0.128999 0.124874 0.112765 0.128022 0.112109 0.129356
qa: -0.0488 -0.4481 -0.4426 0.7674 0.7541 -0.3546 -0.3288 -0.3374 -0.3387 -0.3398 -0.3384 0.0323 0.0306 0.2395 0.2285 -0.1483 -0.1251 -0.1328 -0.1478 -0.1667 -0.1824 -0.1882 -0.1568 -0.1161 -0.1185 -0.1167 -0.1178 0.1347 0.1497 0.1524 0.1352 0.1528 0.1501 0.1494 0.1477 0.1260 0.1118 0.1298 0.1282 0.1130 0.1253 0.1290 0.1249 0.1128 0.1280 0.1121 0.1294
va: 2.3356 1.9884 1.9902 5.4918 5.4891 2.1014 2.1286 2.1039 2.1143 2.1026 2.0971 3.7472 3.7335 3.7190 3.7613 3.9858 3.9252 3.9056 4.0133 4.0521 4.0007 4.0112 3.9790 3.8432 3.8491 3.8455 3.8398 1.0139 0.9927 0.9897 1.0155 1.0052 1.0001 1.0007 1.0101 0.9853 1.0002 0.9909 0.9906 0.9989 0.9867 0.9913 0.9852 0.9996 0.9891 1.0002 0.9904
dispcorr: -0.023175375 hartree
energy: -2950.759829721869
dipole: -0.96967 0.42844 -0.54122 8.36684 -7.17168 1.19516 -2.57129 1.81734 -0.75395
magnitude: 1.51320 au
magnitude: 3.84624 debye
