program: Orca
programVersion: 5.0.2
elementType: S S S P P O O O O O O C C C C C C C C C C C C C C C C H H H H H H H H H H H H H H H H H H H H
charge: 0
multiplicity: 1
keywords: wb97x-d3
keywords: def2-TZVPP
keywords: def2/J RIJCOSX
keywords: DEFGRID2
keywords: scfconv7
keywords: smallprint printgap noloewdin
keywords: NOSOSCF
formula: C16H20O6P2S3
InChI: InChI=1/C16H20O6P2S3/c1-17-23(25,18-2)21-13-5-9-15(10-6-13)27-16-11-7-14(8-12-16)22-24(26,19-3)20-4/h5-12H,1-4H3
47 atoms
S  0.206073 -3.804974 0.334861
S  -4.498966 1.284895 2.890059
S  3.120523 2.284057 -1.297886
P  -4.800763 1.187508 1.001097
P  4.704616 1.23183 -1.069388
O  -4.501996 -0.224625 0.280606
O  4.607363 -0.318857 -1.520909
O  -3.961081 2.161932 0.064724
O  -6.289469 1.430532 0.495754
O  6.000697 1.676926 -1.877722
O  5.270008 1.071878 0.409499
C  -1.166242 -2.683086 0.336282
C  1.513152 -2.751982 -0.232899
C  -3.372563 -0.996372 0.356282
C  3.575554 -1.123171 -1.085861
C  -1.049914 -1.377555 0.800245
C  2.67037 -2.63801 0.527113
C  -2.403541 -3.141926 -0.102671
C  1.406919 -2.066126 -1.440286
C  -2.142375 -0.52526 0.796832
C  3.710939 -1.82634 0.098446
C  -3.508022 -2.306748 -0.07766
C  2.430702 -1.236423 -1.861542
C  -3.726155 3.525734 0.431272
C  -7.419059 0.931697 1.219741
C  5.903201 2.185114 -3.212333
C  5.231227 2.155659 1.343357
H  -0.098876 -1.003027 1.156262
H  2.760985 -3.168993 1.465731
H  -2.512554 -4.152324 -0.475777
H  0.517113 -2.16478 -2.048617
H  -2.009685 0.4910 1.142003
H  4.613645 -1.739963 0.688803
H  -4.469618 -2.665767 -0.42155
H  2.346986 -0.693022 -2.793434
H  -3.085004 3.946993 -0.338876
H  -3.221479 3.592996 1.395258
H  -4.65847 4.0901 0.468562
H  -8.302611 1.263403 0.679989
H  -7.414205 -0.158068 1.260211
H  -7.445558 1.332962 2.232745
H  6.912986 2.447651 -3.517832
H  5.507717 1.43272 -3.895567
H  5.27424 3.074791 -3.248969
H  5.656835 1.779901 2.270429
H  5.824742 3.001272 0.994731
H  4.206692 2.480961 1.524179
elementType: S P O C H
totalener: -2950.73521545 hartree
nucrepener: 3331.73194860 hartree
electener: -6282.46716406 hartree
twoeener: 4412.79510533 hartree
cpcmener: -0.02972606 hartree
kineticenergy: 2942.57028255 hartree
xcener: -192.752671496932 hartree
chargesum: -0.0000000
charge: -0.056387 -0.442662 -0.448161 0.747622 0.767966 -0.308290 -0.351894 -0.334689 -0.339929 -0.336573 -0.339030 0.019505 0.027639 0.275624 0.265560 -0.163342 -0.134822 -0.129899 -0.115472 -0.161431 -0.182383 -0.202559 -0.199118 -0.115003 -0.118247 -0.114249 -0.117675 0.149866 0.134865 0.133949 0.148895 0.123253 0.151687 0.146242 0.147287 0.129713 0.110932 0.128971 0.128984 0.125291 0.112488 0.128994 0.126061 0.111779 0.127531 0.127264 0.113846
qa: -0.0564 -0.4427 -0.4482 0.7476 0.7680 -0.3083 -0.3519 -0.3347 -0.3399 -0.3366 -0.3390 0.0195 0.0276 0.2756 0.2656 -0.1633 -0.1348 -0.1299 -0.1155 -0.1614 -0.1824 -0.2026 -0.1991 -0.1150 -0.1182 -0.1142 -0.1177 0.1499 0.1349 0.1339 0.1489 0.1233 0.1517 0.1462 0.1473 0.1297 0.1109 0.1290 0.1290 0.1253 0.1125 0.1290 0.1261 0.1118 0.1275 0.1273 0.1138
va: 2.3230 1.9908 1.9904 5.5053 5.4917 2.1740 2.1066 2.0873 2.1094 2.1031 2.1127 3.7709 3.7247 3.7359 3.7064 3.9845 3.9855 3.9734 3.9131 3.9410 4.0570 4.0152 4.0171 3.8373 3.8460 3.8400 3.8471 0.9927 1.0143 1.0124 0.9941 1.0289 1.0057 1.0048 1.0063 0.9903 1.0004 0.9887 0.9908 0.9859 0.9991 0.9911 0.9856 1.0003 0.9911 0.9861 0.9991
dispcorr: -0.023149699 hartree
energy: -2950.758365152584
dipole: 0.59844 -0.25506 0.34339 10.05783 -8.87727 1.18056 -1.34540 0.68976 -0.65565
magnitude: 1.39338 au
magnitude: 3.54168 debye
