program: Gaussian 09
title: 000066663
version: EM64L-G09RevD.01
frameworkgroup: C1[X(C21H28N2O)]
method: RPBEPBE
basis: SDD
operation: Freq
keyword: #p
keyword: freq=noraman
keyword: PBEPBE/SDD
title: #p freq=noraman PBEPBE/SDD
converged: YES YES NO NO
title: Mulliken charges:
elementType: O N N C C C C C C C C C C C C C C C C C C C C C H H H H H H H H H H H H H H H H H H H H H H H H H H H H
charge: -0.263425 -0.155242 -0.155184 0.444166 0.444494 -0.396380 -0.398189 -0.398692 -0.396319 0.304643 0.304287 -0.374538 -0.389572 -0.390559 -0.375355 -0.008445 -0.403339 -0.393773 -0.393430 -0.402723 -0.662300 -0.661296 -0.661459 -0.661928 0.228611 0.220446 0.226554 0.221265 0.226498 0.221295 0.228628 0.220469 0.226592 0.225640 0.225409 0.226293 0.266677 0.261507 0.261536 0.266811 0.215483 0.242745 0.215004 0.217176 0.241015 0.213829 0.217283 0.241335 0.213777 0.215485 0.242229 0.214966
chargesum: 0.00000
title: Mulliken charges with hydrogens summed into heavy atoms:
elementType: O N N C C C C C C C C C C C C C C C C C C C C C
charge: -0.263425 -0.155242 -0.155184 0.444166 0.444494 0.052678 0.049630 0.049101 0.052777 0.304643 0.304287 -0.147946 -0.163932 -0.165150 -0.149062 -0.008445 -0.136662 -0.132265 -0.131893 -0.135912 0.010931 0.010723 0.010936 0.010752
polarizability: 4.76470740e+02 1.28283169e-01 2.44787363e+02 -1.15890754e+01 2.16696773e-01 1.67522187e+02
1716.lowfreq: -7.3266 -0.0009 -0.0006 0.0009 3.6237 8.2846 25.2633 27.3440 32.3096
frequency: 24.9324 27.2609 32.2918 54.4942 59.7500 71.7258 73.8125 88.2219 97.9790 107.8722 116.3838 121.4126 159.2653 160.9690 186.8575 215.3352 217.9837 219.1382 223.7374 250.1061 263.7674 288.7507 310.4177 323.1933 330.1282 343.7107 395.3381 406.5592 420.5747 426.0689 449.0792 452.3788 495.5393 511.2761 518.7858 537.8124 558.1594 558.7966 610.6930 628.0189 638.9246 676.8683 708.6489 736.1406 745.5721 770.0718 785.6960 786.2044 787.8299 790.7436 807.6952 815.3260 825.4635 837.4626 891.6330 892.5118 914.5750 922.8685 923.1600 954.2631 969.7864 974.2051 982.3658 995.0453 1001.7901 1013.9069 1015.4073 1072.7749 1072.8816 1077.6691 1078.2375 1095.0249 1095.2021 1129.9388 1134.6212 1152.4943 1160.1254 1169.0666 1196.6512 1202.4888 1202.7243 1218.0711 1267.0092 1268.7968 1288.2754 1288.3501 1301.3319 1317.2904 1318.9661 1340.5280 1340.6582 1351.0779 1351.8201 1366.5214 1366.9972 1386.5090 1386.5616 1389.2459 1389.3213 1400.6894 1401.0146 1439.0876 1440.9223 1466.5564 1466.8642 1469.0954 1469.1716 1476.6304 1476.9419 1483.0474 1483.2234 1492.5002 1492.7694 1500.3829 1502.7327 1504.2360 1523.7768 1527.6135 1546.7656 1560.7251 1618.7558 1629.5975 2982.7399 2983.1246 2983.6376 2983.7262 2988.9237 2989.1020 2995.3674 2995.9220 3038.5377 3038.7562 3044.2802 3044.6624 3078.6419 3078.8088 3079.0509 3079.7229 3091.3930 3092.3475 3093.5433 3094.4658 3134.9797 3140.0301 3141.0890 3141.2933 3161.1590 3161.9348 3165.8769 3167.1550
redmass: 3.7923 3.5575 4.0560 3.8855 3.6077 3.6686 2.8349 3.2072 3.0590 3.4922 3.5977 4.0985 4.8489 2.7958 2.0570 1.0684 1.0437 1.6824 1.2432 4.5263 2.3139 3.8845 2.7930 2.8912 4.1377 3.3267 3.5381 3.5513 3.1426 3.0133 2.6725 2.8104 2.9578 2.8462 3.8709 3.1915 2.8845 3.4003 4.1227 6.8425 6.4666 3.1309 4.4223 3.7320 4.0890 3.9885 1.1378 1.1364 1.1988 1.2629 1.2830 1.2667 1.7076 2.0173 2.3362 2.3181 5.5422 2.1644 2.1941 1.4003 1.3337 1.3939 1.2937 3.1271 2.8101 3.0197 2.7186 2.1523 2.1562 1.8058 1.8016 1.6662 1.6675 1.5136 1.5113 2.5255 1.9350 1.9628 1.2004 2.3242 2.2128 1.2627 1.4187 1.3692 1.2162 1.2155 2.2173 1.6741 1.3414 1.2783 1.2770 1.3516 1.3320 4.1955 4.1569 1.2181 1.2162 1.2332 1.2343 1.9963 1.9771 4.0710 3.9071 1.0462 1.0466 1.0436 1.0436 1.0628 1.0627 1.0489 1.0487 1.0957 1.0860 6.7143 1.3086 1.1994 2.2656 2.6470 6.6010 7.3774 6.0170 6.4086 1.0358 1.0357 1.0358 1.0358 1.0605 1.0606 1.0610 1.0610 1.1024 1.1024 1.1021 1.1021 1.0994 1.0997 1.0996 1.0994 1.1011 1.1010 1.1008 1.1007 1.0876 1.0868 1.0871 1.0871 1.0941 1.0944 1.0952 1.0953
irintensity: 1.4768 0.3370 0.8990 0.1184 0.0018 1.1010 0.0374 1.4830 0.0672 1.1885 0.1387 7.9148 0.3647 0.4805 0.0398 0.1497 0.1786 0.1140 1.7044 5.3593 0.1376 0.1774 1.0794 0.0010 0.2083 0.3403 0.0213 25.1088 2.0338 0.2065 0.1306 2.4713 9.4357 9.5555 0.1838 13.9718 0.8611 29.6239 1.0779 2.0008 0.5574 42.0812 12.1280 0.1757 0.4279 51.2805 1.0323 6.4795 27.0140 7.0976 15.6439 0.0094 24.2039 66.0551 0.4538 0.0278 64.7825 4.0995 2.8300 0.4392 0.7768 19.7759 0.0704 1.2297 17.2500 8.8441 50.3544 11.2377 16.3213 71.8291 9.2739 15.4963 19.8669 9.7183 1.9578 18.0368 107.7245 1.0623 408.4971 45.2244 31.9392 3.2099 254.7723 25.1528 2.5587 2.7060 391.6594 271.3154 1.4515 18.6820 16.8416 141.6847 27.2593 19.6555 7.0922 4.0392 5.0848 14.2095 58.2601 187.9154 101.8305 26.7437 22.4431 6.0656 4.3134 12.7429 5.8243 0.5050 0.4224 0.8485 0.7907 16.2820 26.0154 192.9608 0.1358 2.8749 47.3646 113.4276 21.6401 80.6411 998.2674 89.4235 31.7083 35.8337 24.5887 35.3637 47.9553 50.8056 102.1094 37.6418 6.8129 6.4167 12.9329 12.3770 30.2473 40.0899 61.9720 52.5846 30.4901 2.2365 95.5769 59.7600 22.7485 1.5729 6.9950 2.9807 26.6244 27.4913 36.0464 6.3658
temp: 298.150 k
press: 1.00000 atm
elementType: 8 7 7 6 6 6 6 6 6 6 6 6 6 6 6 6 6 6 6 6 6 6 6 6 1 1 1 1 1 1 1 1 1 1 1 1 1 1 1 1 1 1 1 1 1 1 1 1 1 1 1 1
symmnumber: 1
zpe: 1164106.1 jmol-1
zpe.correction: 0.443385 hartree
zpe.thermalcorrener: 0.468284 hartree
zpe.thermalcorrenthalpy: 0.469229 hartree
zpe.thermalcorrgfe: 0.387370 hartree
zpe.sumelectzpe: -999.966596 hartree
zpe.sumelectthermal: -999.941696 hartree
zpe.sumelectthermalent: -999.940752 hartree
zpe.sumelectthermalfe: -1000.022610 hartree
dipole: -0.0030 -6.3791 0.0123
dipole: 6.3791
quadrupole: -80.7387 -151.0940 -147.5970
quadrupole: 0.0595 -2.4886 0.0450
quadrupole: 45.7379 -24.6175 -21.1204 0.0595 -2.4886 0.0450
hfenergy: -1000.4099804 hartree
pointgroup: C01 [X(C21H28N2O1)]
dipole: 0.0798566 1.6599096 -1.8806959 debye
polarizability: 475.0606678|11.5834065|201.7653992|20.3644526|-37.8375662|211.9542233 unknown
InChI: InChI=1S/C21H28N2O/c1-5-22(6-2)19-13-9-17(10-14-19)21(24)18-11-15-20(16-12-18)23(7-3)8-4/h9-16H,5-8H2,1-4H3
charge 0 multiplicity 1
52 atoms
O  -0.103504 -1.950079 2.523279
N  -5.133151 0.690529 -0.56643
N  5.172029 0.588794 -0.218637
C  -3.898426 0.271654 -0.061252
C  3.896594 0.1975 0.2008
C  -6.357421 -0.118528 -0.394282
C  -5.280006 1.962086 -1.302475
C  5.405112 1.166434 -1.557463
C  6.35583 0.440029 0.652494
C  -1.338545 -0.60811 0.960241
C  1.256913 -0.602002 1.073406
C  -3.739455 -1.014486 0.558697
C  2.77175 0.231732 -0.687995
C  -2.736278 1.109056 -0.130725
C  3.657319 -0.267535 1.5386
C  -0.063944 -1.096885 1.567874
C  -2.499497 -1.423821 1.064176
C  1.490971 -0.14834 -0.254178
C  -1.494082 0.670464 0.356663
C  2.378726 -0.667586 1.945893
C  -6.54772 -1.192862 -1.491277
C  -5.554285 3.180343 -0.388662
C  5.654804 0.103684 -2.65444
C  6.581278 1.641858 1.600525
H  -6.351832 -0.589134 0.605998
H  -7.221373 0.572687 -0.402663
H  -4.377276 2.139325 -1.915659
H  -6.117366 1.843873 -2.016344
H  4.550045 1.80991 -1.835589
H  6.283407 1.836067 -1.488317
H  6.270876 -0.495714 1.234818
H  7.241179 0.315146 0.000486
H  -4.587642 -1.700787 0.634944
H  2.900835 0.529876 -1.732244
H  -2.806618 2.119601 -0.543047
H  4.474245 -0.306403 2.264753
H  -2.396624 -2.39793 1.554731
H  0.667471 -0.140263 -0.976282
H  -0.640363 1.355297 0.312722
H  2.214016 -1.042747 2.96185
H  -6.613536 -0.726147 -2.490905
H  -5.700688 -1.900096 -1.503303
H  -7.477881 -1.765317 -1.31719
H  -6.483085 3.033771 0.192038
H  -4.729238 3.334066 0.328334
H  -5.66826 4.100567 -0.991733
H  6.537478 -0.513483 -2.407137
H  4.788418 -0.572439 -2.755729
H  5.836549 0.588112 -3.631995
H  6.719207 2.575127 1.024816
H  5.717507 1.784031 2.272761
H  7.483538 1.483776 2.220351
