program: Orca
programVersion: 5.0.2
elementType: S S S P P O O O O O O C C C C C C C C C C C C C C C C H H H H H H H H H H H H H H H H H H H H
charge: 0
multiplicity: 1
keywords: wb97x-d3
keywords: def2-TZVPP
keywords: def2/J RIJCOSX
keywords: DEFGRID2
keywords: scfconv7
keywords: smallprint printgap noloewdin
keywords: NOSOSCF
formula: C16H20O6P2S3
InChI: InChI=1/C16H20O6P2S3/c1-17-23(25,18-2)21-13-5-9-15(10-6-13)27-16-11-7-14(8-12-16)22-24(26,19-3)20-4/h5-12H,1-4H3
47 atoms
S  0.005736 -3.570967 -0.82345
S  -5.140754 1.393703 -1.448227
S  3.56503 2.225865 0.214876
P  -5.055898 1.191626 0.45435
P  5.067454 1.094556 -0.148404
O  -4.508073 -0.220741 1.015774
O  4.912501 -0.461008 0.269232
O  -6.427584 1.294172 1.254238
O  -4.121739 2.190389 1.268113
O  5.520673 0.950348 -1.666779
O  6.443614 1.448462 0.567622
C  -1.300902 -2.506935 -0.281104
C  1.4500 -2.607807 -0.480498
C  -3.435415 -0.931423 0.539729
C  3.756891 -1.164302 0.005958
C  -1.261834 -1.127024 -0.448988
C  1.677276 -2.058845 0.779409
C  -2.425042 -3.091523 0.293106
C  2.395688 -2.444033 -1.484975
C  -2.31474 -0.334237 -0.021991
C  2.821211 -1.318595 1.018426
C  -3.498094 -2.308253 0.685117
C  3.559912 -1.729313 -1.241735
C  -7.645451 0.769468 0.714517
C  -4.13096 3.595762 0.992172
C  5.514043 2.074151 -2.55377
C  6.491095 1.787695 1.957901
H  -0.401833 -0.649721 -0.900214
H  0.954678 -2.191499 1.574247
H  -2.471104 -4.162627 0.444077
H  2.225627 -2.861851 -2.468839
H  -2.236907 0.738556 -0.135686
H  2.994681 -0.879668 1.992368
H  -4.372855 -2.767594 1.12738
H  4.298343 -1.614144 -2.024231
H  -7.897323 1.254316 -0.22841
H  -8.422409 0.980501 1.444818
H  -7.580897 -0.308315 0.563082
H  -3.851217 3.794404 -0.042437
H  -5.109253 4.032006 1.195213
H  -3.395922 4.045727 1.654534
H  6.212142 2.843396 -2.222388
H  5.828697 1.70225 -3.525345
H  4.51511 2.501628 -2.637394
H  6.19399 0.942541 2.5799
H  7.523086 2.047157 2.179793
H  5.85091 2.642443 2.177105
elementType: S P O C H
totalener: -2950.73621086 hartree
nucrepener: 3311.78133548 hartree
electener: -6262.51754635 hartree
twoeener: 4392.90124452 hartree
cpcmener: -0.03033251 hartree
kineticenergy: 2942.57062492 hartree
xcener: -192.752625689966 hartree
chargesum: 0.0000000
charge: -0.042195 -0.442400 -0.447491 0.751821 0.765141 -0.317021 -0.351720 -0.340909 -0.336649 -0.338457 -0.336058 0.032011 0.042709 0.246681 0.241043 -0.171259 -0.142490 -0.137378 -0.143446 -0.151980 -0.181577 -0.190395 -0.167053 -0.118424 -0.117065 -0.116917 -0.113744 0.150484 0.152891 0.134371 0.136526 0.131108 0.149324 0.146500 0.153347 0.113477 0.129007 0.125600 0.111897 0.128687 0.129848 0.126754 0.127584 0.113051 0.125943 0.129167 0.109654
qa: -0.0422 -0.4424 -0.4475 0.7518 0.7651 -0.3170 -0.3517 -0.3409 -0.3366 -0.3385 -0.3361 0.0320 0.0427 0.2467 0.2410 -0.1713 -0.1425 -0.1374 -0.1434 -0.1520 -0.1816 -0.1904 -0.1671 -0.1184 -0.1171 -0.1169 -0.1137 0.1505 0.1529 0.1344 0.1365 0.1311 0.1493 0.1465 0.1533 0.1135 0.1290 0.1256 0.1119 0.1287 0.1298 0.1268 0.1276 0.1131 0.1259 0.1292 0.1097
va: 2.3595 1.9904 1.9906 5.4948 5.4961 2.1528 2.1030 2.1059 2.0903 2.1129 2.1076 3.7782 3.7297 3.7562 3.7264 3.9761 3.9265 3.9722 3.9993 3.9354 4.0050 4.0116 4.0477 3.8441 3.8385 3.8458 3.8427 0.9939 0.9913 1.0114 1.0139 1.0226 1.0013 1.0036 1.0056 0.9992 0.9913 0.9856 1.0000 0.9893 0.9902 0.9863 0.9910 0.9994 0.9864 0.9904 1.0007
dispcorr: -0.023146630 hartree
energy: -2950.759357495439
dipole: 0.87168 -0.40324 0.46844 9.12423 -8.18717 0.93706 2.57437 -1.76473 0.80963
magnitude: 1.32402 au
magnitude: 3.36538 debye
