program: Orca
programVersion: 5.0.2
elementType: S S S P P O O O O O O C C C C C C C C C C C C C C C C H H H H H H H H H H H H H H H H H H H H
charge: 0
multiplicity: 1
keywords: wb97x-d3
keywords: def2-TZVPP
keywords: def2/J RIJCOSX
keywords: DEFGRID2
keywords: scfconv7
keywords: smallprint printgap noloewdin
keywords: NOSOSCF
formula: C16H20O6P2S3
InChI: InChI=1/C16H20O6P2S3/c1-17-23(25,18-2)21-13-5-9-15(10-6-13)27-16-11-7-14(8-12-16)22-24(26,19-3)20-4/h5-12H,1-4H3
47 atoms
S  0.006272 -3.600075 0.795303
S  -3.514953 2.183875 -0.155649
S  5.069741 1.423648 1.440214
P  -5.043575 1.078689 0.17548
P  5.005415 1.22557 -0.463516
O  -4.904463 -0.4796 -0.238911
O  4.480147 -0.191869 -1.033345
O  -6.398683 1.453069 -0.570641
O  -5.531943 0.941969 1.683571
O  4.069367 2.217091 -1.284019
O  6.383143 1.346255 -1.249694
C  -1.443385 -2.638979 0.47235
C  1.299868 -2.519667 0.253797
C  -3.750118 -1.189284 0.012569
C  3.41577 -0.917408 -0.561078
C  -2.363453 -2.449897 1.495338
C  2.440478 -3.091444 -0.300221
C  -1.696317 -2.113266 -0.792616
C  1.234872 -1.138762 0.404247
C  -3.528448 -1.731382 1.266022
C  3.504179 -2.294253 -0.689609
C  -2.840491 -1.37009 -1.019114
C  2.279081 -0.333068 -0.01954
C  -6.404745 1.806224 -1.958609
C  -5.495606 2.057881 2.580633
C  4.068877 3.622344 -1.006113
C  7.601476 0.832937 -0.698652
H  -2.172211 -2.849969 2.482547
H  2.507189 -4.163445 -0.436522
H  -0.993091 -2.266615 -1.6010
H  0.362493 -0.670136 0.840385
H  -4.247296 -1.59512 2.063129
H  4.391535 -2.743605 -1.116674
H  -3.033494 -0.94642 -1.996086
H  2.180077 0.739422 0.078586
H  -5.75077 2.656458 -2.151162
H  -7.427359 2.077949 -2.205616
H  -6.098435 0.964575 -2.580042
H  -4.478036 2.425158 2.706602
H  -6.13394 2.868617 2.230634
H  -5.868389 1.697295 3.535005
H  3.353489 4.072315 -1.688991
H  3.758286 3.818639 0.01981
H  5.051717 4.06026 -1.179055
H  7.851153 1.336218 0.234709
H  7.538624 -0.241438 -0.526331
H  8.378155 1.030851 -1.432162
elementType: S P O C H
totalener: -2950.73615505 hartree
nucrepener: 3316.90291538 hartree
electener: -6267.63907042 hartree
twoeener: 4398.03460255 hartree
cpcmener: -0.03049330 hartree
kineticenergy: 2942.58583074 hartree
xcener: -192.755296879789 hartree
chargesum: -0.0000000
charge: -0.042869 -0.446848 -0.442514 0.765482 0.751967 -0.351854 -0.317902 -0.336786 -0.339387 -0.337106 -0.341106 0.045876 0.033486 0.239036 0.244491 -0.143432 -0.139074 -0.144067 -0.169904 -0.166010 -0.189089 -0.179380 -0.153901 -0.114521 -0.117613 -0.117398 -0.118363 0.136769 0.133936 0.152798 0.149362 0.153833 0.146620 0.149922 0.131600 0.110208 0.129380 0.125983 0.113907 0.127397 0.127932 0.129921 0.112363 0.128429 0.113884 0.125346 0.129194
qa: -0.0429 -0.4468 -0.4425 0.7655 0.7520 -0.3519 -0.3179 -0.3368 -0.3394 -0.3371 -0.3411 0.0459 0.0335 0.2390 0.2445 -0.1434 -0.1391 -0.1441 -0.1699 -0.1660 -0.1891 -0.1794 -0.1539 -0.1145 -0.1176 -0.1174 -0.1184 0.1368 0.1339 0.1528 0.1494 0.1538 0.1466 0.1499 0.1316 0.1102 0.1294 0.1260 0.1139 0.1274 0.1279 0.1299 0.1124 0.1284 0.1139 0.1253 0.1292
va: 2.3585 1.9899 1.9900 5.4931 5.4941 2.1024 2.1511 2.1070 2.1106 2.0901 2.1050 3.7244 3.7816 3.7274 3.7563 4.0023 3.9703 3.9302 3.9717 4.0446 4.0113 4.0033 3.9386 3.8429 3.8448 3.8393 3.8441 1.0138 1.0113 0.9919 0.9949 1.0055 1.0035 1.0002 1.0223 1.0005 0.9905 0.9862 0.9990 0.9865 0.9914 0.9904 0.9996 0.9893 0.9989 0.9858 0.9915
dispcorr: -0.023225311 hartree
energy: -2950.759380356440
dipole: -0.72494 0.26019 -0.46474 9.28399 -8.31553 0.96847 -2.58573 1.77205 -0.81368
magnitude: 1.34759 au
magnitude: 3.42529 debye
