program: Orca
programVersion: 5.0.2
elementType: S S S P P O O O O O O C C C C C C C C C C C C C C C C H H H H H H H H H H H H H H H H H H H H
charge: 0
multiplicity: 1
keywords: wb97x-d3
keywords: def2-TZVPP
keywords: def2/J RIJCOSX
keywords: DEFGRID2
keywords: scfconv7
keywords: smallprint printgap noloewdin
keywords: NOSOSCF
formula: C16H20O6P2S3
InChI: InChI=1/C16H20O6P2S3/c1-17-23(25,18-2)21-13-5-9-15(10-6-13)27-16-11-7-14(8-12-16)22-24(26,19-3)20-4/h5-12H,1-4H3
47 atoms
S  0.086352 -3.557188 0.449923
S  -4.078171 1.660633 -1.313999
S  4.47594 1.812986 1.356234
P  -5.187753 1.028662 0.114287
P  5.274259 1.137001 -0.248636
O  -4.982084 -0.517482 0.543032
O  4.34023 0.209438 -1.187507
O  -6.763417 1.067611 -0.10598
O  -5.048866 1.738092 1.532334
O  5.7862 2.206864 -1.311432
O  6.552979 0.200229 -0.10465
C  -1.393389 -2.585271 0.448255
C  1.319534 -2.369678 -0.002317
C  -3.771223 -1.167651 0.508706
C  3.357625 -0.642087 -0.744544
C  -2.501088 -3.048407 -0.251431
C  1.123299 -1.459158 -1.037438
C  -1.488362 -1.408773 1.186785
C  2.546362 -2.409479 0.649695
C  -3.694618 -2.341728 -0.219187
C  2.132775 -0.583021 -1.394101
C  -2.671151 -0.691002 1.210109
C  3.574294 -1.556817 0.273055
C  -7.349118 0.723033 -1.365283
C  -5.043135 3.165968 1.644011
C  5.008367 3.369792 -1.616342
C  7.626446 0.555393 0.77457
H  -2.437854 -3.958011 -0.834457
H  0.178999 -1.420078 -1.565052
H  -0.637833 -1.043784 1.748055
H  2.711469 -3.105359 1.462237
H  -4.557197 -2.700269 -0.766111
H  1.976191 0.132229 -2.191482
H  -2.733321 0.217232 1.795322
H  4.529335 -1.622069 0.777844
H  -8.41808 0.893967 -1.266666
H  -7.175034 -0.325931 -1.607422
H  -6.957645 1.350451 -2.166154
H  -4.250011 3.604772 1.037918
H  -6.003579 3.587483 1.346586
H  -4.86148 3.394654 2.691001
H  5.581951 3.946137 -2.33766
H  4.048217 3.099872 -2.057539
H  4.840494 3.974156 -0.724809
H  8.103324 1.484429 0.461278
H  7.275991 0.654978 1.802159
H  8.351083 -0.253005 0.720789
elementType: S P O C H
totalener: -2950.73674837 hartree
nucrepener: 3297.11992321 hartree
electener: -6247.85667158 hartree
twoeener: 4378.26995380 hartree
cpcmener: -0.03108901 hartree
kineticenergy: 2942.54921800 hartree
xcener: -192.747812119735 hartree
chargesum: 0.0000000
charge: -0.048882 -0.445295 -0.444954 0.758582 0.758001 -0.334349 -0.329668 -0.339007 -0.336881 -0.339614 -0.337551 0.028198 0.030810 0.222930 0.228701 -0.132537 -0.131327 -0.138012 -0.153127 -0.178798 -0.185437 -0.159501 -0.157628 -0.115612 -0.116469 -0.116955 -0.118095 0.134927 0.150143 0.151427 0.134485 0.149626 0.149201 0.152269 0.143918 0.128931 0.125264 0.110764 0.110816 0.127641 0.129009 0.128862 0.124964 0.111220 0.128026 0.111711 0.129272
qa: -0.0489 -0.4453 -0.4450 0.7586 0.7580 -0.3343 -0.3297 -0.3390 -0.3369 -0.3396 -0.3376 0.0282 0.0308 0.2229 0.2287 -0.1325 -0.1313 -0.1380 -0.1531 -0.1788 -0.1854 -0.1595 -0.1576 -0.1156 -0.1165 -0.1170 -0.1181 0.1349 0.1501 0.1514 0.1345 0.1496 0.1492 0.1523 0.1439 0.1289 0.1253 0.1108 0.1108 0.1276 0.1290 0.1289 0.1250 0.1112 0.1280 0.1117 0.1293
va: 2.3401 1.9879 1.9875 5.4855 5.4851 2.1220 2.1284 2.1059 2.1028 2.1058 2.0967 3.7333 3.7591 3.7474 3.7511 3.9741 3.9186 3.9625 3.9996 4.0286 4.0020 3.9610 3.9760 3.8447 3.8402 3.8472 3.8409 1.0138 0.9911 0.9935 1.0150 0.9991 1.0011 1.0083 1.0122 0.9908 0.9853 1.0011 1.0003 0.9888 0.9901 0.9909 0.9853 1.0003 0.9889 1.0000 0.9903
dispcorr: -0.023117321 hartree
energy: -2950.759865688416
dipole: -0.54582 0.21025 -0.33556 9.12046 -8.09888 1.02159 -1.49457 1.13521 -0.35936
magnitude: 1.13375 au
magnitude: 2.88175 debye
