program: Orca
programVersion: 5.0.2
elementType: S S S P P O O O O O O C C C C C C C C C C C C C C C C H H H H H H H H H H H H H H H H H H H H
charge: 0
multiplicity: 1
keywords: wb97x-d3
keywords: def2-TZVPP
keywords: def2/J RIJCOSX
keywords: DEFGRID2
keywords: scfconv7
keywords: smallprint printgap noloewdin
keywords: NOSOSCF
formula: C16H20O6P2S3
InChI: InChI=1/C16H20O6P2S3/c1-17-23(25,18-2)21-13-5-9-15(10-6-13)27-16-11-7-14(8-12-16)22-24(26,19-3)20-4/h5-12H,1-4H3
47 atoms
S  0.013957 -2.745428 0.364836
S  -6.323173 -0.219999 1.836763
S  6.907904 -0.892893 -0.050345
P  -6.138323 0.631811 0.130986
P  6.076314 0.823683 -0.219985
O  -4.630371 0.84371 -0.40846
O  4.564813 0.843703 -0.793151
O  -6.708935 2.111678 -0.014014
O  -6.79497 -0.084749 -1.129555
O  5.885559 1.6915 1.100018
O  6.75605 1.871596 -1.205005
C  -1.35825 -1.645684 0.138688
C  1.387928 -1.680306 0.026986
C  -3.583278 -0.021875 -0.197523
C  3.556106 -0.027834 -0.477992
C  -1.30414 -0.3009 0.493457
C  2.295074 -1.385887 1.03552
C  -2.540557 -2.168558 -0.37384
C  1.583601 -1.152373 -1.247086
C  -2.412987 0.510134 0.321246
C  3.385696 -0.562213 0.78988
C  -3.658031 -1.363044 -0.537419
C  2.661912 -0.3251 -1.499167
C  -6.53282 3.078114 1.027462
C  -8.132417 -0.593015 -1.07895
C  6.956502 1.848187 2.038705
C  7.345166 1.459513 -2.443809
H  -0.399323 0.126388 0.905786
H  2.15045 -1.784258 2.031231
H  -2.597281 -3.209233 -0.667187
H  0.892711 -1.383357 -2.047538
H  -2.366377 1.557487 0.591561
H  4.062257 -0.330902 1.601452
H  -4.560597 -1.785512 -0.959471
H  2.811674 0.092318 -2.486728
H  -7.034273 3.984431 0.697353
H  -5.476836 3.295004 1.192709
H  -6.983614 2.737397 1.959565
H  -8.248208 -1.315592 -0.271029
H  -8.855257 0.213428 -0.953216
H  -8.31118 -1.086855 -2.03068
H  6.555614 2.417201 2.87346
H  7.308914 0.881393 2.398746
H  7.78845 2.397765 1.597705
H  6.597691 1.038032 -3.116554
H  7.768877 2.352343 -2.896232
H  8.137883 0.729922 -2.278649
elementType: S P O C H
totalener: -2950.73638497 hartree
nucrepener: 3224.78860906 hartree
electener: -6175.52499403 hartree
twoeener: 4305.63161089 hartree
cpcmener: -0.03144975 hartree
kineticenergy: 2942.54824933 hartree
xcener: -192.748676632018 hartree
chargesum: 0.0000000
charge: -0.058819 -0.446172 -0.440367 0.756127 0.750141 -0.332062 -0.317160 -0.340039 -0.337573 -0.336510 -0.339546 0.042739 0.030109 0.211420 0.258166 -0.147196 -0.152113 -0.157842 -0.116550 -0.182423 -0.160131 -0.151780 -0.187528 -0.116429 -0.116233 -0.116099 -0.116673 0.151933 0.136744 0.133398 0.145816 0.149693 0.137286 0.147098 0.149317 0.129189 0.124945 0.111089 0.110711 0.127571 0.128799 0.129757 0.111013 0.128952 0.126026 0.129007 0.112197
qa: -0.0588 -0.4462 -0.4404 0.7561 0.7501 -0.3321 -0.3172 -0.3400 -0.3376 -0.3365 -0.3395 0.0427 0.0301 0.2114 0.2582 -0.1472 -0.1521 -0.1578 -0.1166 -0.1824 -0.1601 -0.1518 -0.1875 -0.1164 -0.1162 -0.1161 -0.1167 0.1519 0.1367 0.1334 0.1458 0.1497 0.1373 0.1471 0.1493 0.1292 0.1249 0.1111 0.1107 0.1276 0.1288 0.1298 0.1110 0.1290 0.1260 0.1290 0.1122
va: 2.3180 1.9878 1.9933 5.4894 5.4960 2.1233 2.1495 2.1034 2.0997 2.0925 2.1075 3.7786 3.7273 3.7628 3.7567 3.9071 4.0319 3.9969 3.9449 4.0120 3.9577 3.9817 3.9879 3.8461 3.8404 3.8371 3.8434 0.9893 1.0154 1.0141 0.9970 1.0004 1.0179 1.0098 1.0023 0.9907 0.9852 1.0004 1.0003 0.9888 0.9901 0.9899 1.0007 0.9893 0.9856 0.9910 0.9999
dispcorr: -0.022817032 hartree
energy: -2950.759201998640
dipole: -0.59452 0.71467 0.12015 9.28666 -7.25133 2.03533 -1.80961 1.06161 -0.74800
magnitude: 2.17175 au
magnitude: 5.52016 debye
