program: Orca
programVersion: 5.0.2
elementType: S S S P P O O O O O O C C C C C C C C C C C C C C C C H H H H H H H H H H H H H H H H H H H H
charge: 0
multiplicity: 1
keywords: wb97x-d3
keywords: def2-TZVPP
keywords: def2/J RIJCOSX
keywords: DEFGRID2
keywords: scfconv7
keywords: smallprint printgap noloewdin
keywords: NOSOSCF
formula: C16H20O6P2S3
InChI: InChI=1/C16H20O6P2S3/c1-17-23(25,18-2)21-13-5-9-15(10-6-13)27-16-11-7-14(8-12-16)22-24(26,19-3)20-4/h5-12H,1-4H3
47 atoms
S  0.008492 -3.978183 -0.235302
S  -3.777331 0.984969 3.038195
S  2.82212 2.048541 -1.812403
P  -4.384551 1.168069 1.229887
P  4.415361 1.373333 -0.990524
O  -4.499552 -0.1911 0.360075
O  4.542685 -0.235137 -0.880484
O  -3.504552 2.070234 0.259177
O  -5.84457 1.761007 1.00897
O  5.804872 1.725686 -1.682651
O  4.698764 1.788856 0.51948
C  -1.336019 -2.83347 -0.062377
C  1.359486 -2.842397 -0.413385
C  -3.438879 -1.062766 0.233165
C  3.469532 -1.077115 -0.709874
C  -1.518945 -1.805667 -0.984171
C  1.595614 -1.865214 0.550152
C  -2.229118 -2.981565 0.991659
C  2.200923 -2.940451 -1.514231
C  -2.560696 -0.908528 -0.829977
C  2.643331 -0.974065 0.401195
C  -3.289995 -2.098197 1.139175
C  3.261104 -2.057304 -1.663889
C  -2.851137 3.25606 0.72384
C  -6.943565 1.365974 1.836882
C  5.952944 1.667632 -3.105539
C  4.525599 3.144705 0.948937
H  -0.841062 -1.691289 -1.820312
H  0.956196 -1.788167 1.420163
H  -2.094286 -3.775363 1.714937
H  2.023833 -3.692077 -2.272441
H  -2.699581 -0.107879 -1.544666
H  2.820083 -0.221072 1.15841
H  -3.985125 -2.213079 1.960194
H  3.911513 -2.125044 -2.526535
H  -2.170533 3.032131 1.544793
H  -3.574919 4.005932 1.043455
H  -2.283221 3.644111 -0.117863
H  -7.169666 0.306323 1.714341
H  -6.739879 1.574997 2.887113
H  -7.800242 1.952256 1.5144
H  5.288958 2.378403 -3.597492
H  6.984937 1.932583 -3.320729
H  5.756055 0.664339 -3.485298
H  5.204769 3.816558 0.423404
H  3.497864 3.475208 0.797908
H  4.75614 3.164914 2.010865
elementType: S P O C H
totalener: -2950.73641337 hartree
nucrepener: 3374.48839091 hartree
electener: -6325.22480429 hartree
twoeener: 4455.65097029 hartree
cpcmener: -0.03011530 hartree
kineticenergy: 2942.56596193 hartree
xcener: -192.748412312320 hartree
chargesum: -0.0000000
charge: -0.065702 -0.450448 -0.445478 0.767694 0.760158 -0.351426 -0.336929 -0.338359 -0.336003 -0.339068 -0.338020 0.023189 0.034093 0.266437 0.227352 -0.120543 -0.123605 -0.129308 -0.139433 -0.189347 -0.166052 -0.193983 -0.177107 -0.116565 -0.114826 -0.117140 -0.119213 0.146094 0.145837 0.134863 0.134379 0.151191 0.152139 0.144458 0.150240 0.113543 0.126982 0.127713 0.126700 0.109886 0.129420 0.112041 0.129438 0.124600 0.127940 0.112767 0.129402
qa: -0.0657 -0.4504 -0.4455 0.7677 0.7602 -0.3514 -0.3369 -0.3384 -0.3360 -0.3391 -0.3380 0.0232 0.0341 0.2664 0.2274 -0.1205 -0.1236 -0.1293 -0.1394 -0.1893 -0.1661 -0.1940 -0.1771 -0.1166 -0.1148 -0.1171 -0.1192 0.1461 0.1458 0.1349 0.1344 0.1512 0.1521 0.1445 0.1502 0.1135 0.1270 0.1277 0.1267 0.1099 0.1294 0.1120 0.1294 0.1246 0.1279 0.1128 0.1294
va: 2.2897 1.9904 1.9867 5.4948 5.4832 2.1061 2.1179 2.1129 2.1039 2.1042 2.1016 3.7398 3.7152 3.6958 3.7340 3.9148 3.9474 3.9657 3.9783 4.0458 3.9777 4.0431 4.0293 3.8456 3.8409 3.8480 3.8419 0.9936 0.9957 1.0137 1.0138 1.0060 1.0079 1.0079 0.9978 0.9996 0.9860 0.9909 0.9856 1.0008 0.9905 0.9997 0.9910 0.9849 0.9882 0.9994 0.9909
dispcorr: -0.023672216 hartree
energy: -2950.760085590468
dipole: 1.68325 -1.19313 0.49013 11.11428 -9.74525 1.36903 -0.80423 0.36334 -0.44089
magnitude: 1.51949 au
magnitude: 3.86225 debye
