program: Orca
programVersion: 5.0.2
elementType: S S S P P O O O O O O C C C C C C C C C C C C C C C C H H H H H H H H H H H H H H H H H H H H
charge: 0
multiplicity: 1
keywords: wb97x-d3
keywords: def2-TZVPP
keywords: def2/J RIJCOSX
keywords: DEFGRID2
keywords: scfconv7
keywords: smallprint printgap noloewdin
keywords: NOSOSCF
formula: C16H20O6P2S3
InChI: InChI=1/C16H20O6P2S3/c1-17-23(25,18-2)21-13-5-9-15(10-6-13)27-16-11-7-14(8-12-16)22-24(26,19-3)20-4/h5-12H,1-4H3
47 atoms
S  0.018831 -4.019063 0.207337
S  -2.771478 2.110179 1.710165
S  3.465001 1.07052 -2.852009
P  -4.349001 1.385836 0.913459
P  4.315938 1.151566 -1.142573
O  -4.469981 -0.222818 0.862469
O  4.542825 -0.253209 -0.376773
O  -4.63279 1.750478 -0.613987
O  -5.746793 1.760979 1.586235
O  5.796822 1.741314 -1.097882
O  3.589694 1.992342 0.000016
C  -1.309301 -2.858403 0.382766
C  1.384523 -2.899681 0.052548
C  -3.404686 -1.069669 0.684416
C  3.496642 -1.1377 -0.233776
C  -2.214739 -3.010978 1.424507
C  2.236318 -3.002924 -1.039415
C  -1.473429 -1.810661 -0.517744
C  1.615602 -1.922812 1.016392
C  -3.265787 -2.119302 1.575174
C  3.299175 -2.123443 -1.184126
C  -2.512286 -0.911061 -0.366529
C  2.662503 -1.032017 0.869347
C  -4.513646 3.095718 -1.064364
C  -5.89226 1.776762 3.000667
C  6.750898 1.392447 -2.09361
C  2.916167 3.211877 -0.2912
H  -2.087915 -3.817169 2.134813
H  2.053815 -3.754899 -1.795428
H  -0.777425 -1.686725 -1.33654
H  0.959972 -1.843739 1.87324
H  -3.966777 -2.229462 2.391723
H  3.951413 -2.186195 -2.044173
H  -2.632716 -0.102836 -1.074949
H  2.83777 -0.262093 1.608071
H  -5.331083 3.708366 -0.682821
H  -4.56566 3.070191 -2.149658
H  -3.563018 3.532768 -0.756124
H  -5.87385 0.76489 3.408578
H  -5.105424 2.366263 3.473277
H  -6.859131 2.225845 3.2132
H  7.073192 0.356255 -1.982289
H  6.346181 1.535551 -3.096486
H  7.60728 2.046623 -1.951661
H  2.264158 3.105753 -1.158452
H  2.318182 3.456424 0.582736
H  3.630312 4.015356 -0.47394
totalener: -2950.71120547 hartree
nucrepener: 3389.61410697 hartree
electener: -6340.32531244 hartree
twoeener: 4469.63992141 hartree
kineticenergy: 2942.65821563 hartree
xcener: -192.767061301310 hartree
chargesum: -0.0000000
charge: -0.039720 -0.386837 -0.399127 0.706638 0.727161 -0.317643 -0.336922 -0.315728 -0.316876 -0.311491 -0.319056 0.002105 -0.004409 0.219493 0.241353 -0.123959 -0.114829 -0.098588 -0.083430 -0.145254 -0.145324 -0.119858 -0.159558 -0.126630 -0.122425 -0.123616 -0.120276 0.114992 0.117016 0.127269 0.124383 0.117136 0.118856 0.120514 0.129927 0.117775 0.118016 0.108948 0.110988 0.109863 0.116588 0.114501 0.109411 0.116482 0.111988 0.116334 0.113821
qa: -0.0397 -0.3868 -0.3991 0.7066 0.7272 -0.3176 -0.3369 -0.3157 -0.3169 -0.3115 -0.3191 0.0021 -0.0044 0.2195 0.2414 -0.1240 -0.1148 -0.0986 -0.0834 -0.1453 -0.1453 -0.1199 -0.1596 -0.1266 -0.1224 -0.1236 -0.1203 0.1150 0.1170 0.1273 0.1244 0.1171 0.1189 0.1205 0.1299 0.1178 0.1180 0.1089 0.1110 0.1099 0.1166 0.1145 0.1094 0.1165 0.1120 0.1163 0.1138
va: 2.3126 2.0491 2.0421 5.5274 5.5248 2.1445 2.1225 2.1119 2.1204 2.1221 2.1304 3.8379 3.8328 3.8380 3.8056 4.0041 3.9855 3.9666 3.9316 4.0454 4.0588 3.9804 4.0590 3.8608 3.8701 3.8672 3.8677 1.0199 1.0191 1.0005 1.0008 1.0094 1.0142 1.0183 1.0130 0.9904 0.9906 1.0052 0.9877 1.0056 0.9909 0.9876 1.0052 0.9911 1.0050 0.9912 0.9873
dispcorr: -0.023671078 hartree
energy: -2950.734876550430
dipole: -1.71595 1.41340 -0.30255 11.23024 -10.15325 1.07699 0.57291 -0.30416 0.26875
magnitude: 1.15051 au
magnitude: 2.92437 debye
