program: Orca
programVersion: 5.0.2
elementType: S S S P P O O O O O O C C C C C C C C C C C C C C C C H H H H H H H H H H H H H H H H H H H H
charge: 0
multiplicity: 1
keywords: wb97x-d3
keywords: def2-TZVPP
keywords: def2/J RIJCOSX
keywords: DEFGRID2
keywords: scfconv7
keywords: smallprint printgap noloewdin
keywords: NOSOSCF
formula: C16H20O6P2S3
InChI: InChI=1/C16H20O6P2S3/c1-17-23(25,18-2)21-13-5-9-15(10-6-13)27-16-11-7-14(8-12-16)22-24(26,19-3)20-4/h5-12H,1-4H3
47 atoms
S  0.021871 -4.025544 0.22887
S  -2.76533 2.114109 1.706014
S  3.419346 1.075568 -2.837137
P  -4.341444 1.391195 0.905521
P  4.303445 1.147699 -1.144307
O  -4.46291 -0.217441 0.849672
O  4.543605 -0.262942 -0.392189
O  -4.623316 1.75837 -0.621642
O  -5.740253 1.766777 1.577353
O  5.785262 1.736821 -1.123331
O  3.600355 1.982184 0.017844
C  -1.304109 -2.860954 0.3926
C  1.389246 -2.909943 0.065624
C  -3.398669 -1.066366 0.678195
C  3.499605 -1.147998 -0.237854
C  -2.227388 -3.020061 1.41801
C  2.23624 -3.017599 -1.02964
C  -1.451415 -1.804316 -0.501167
C  1.625462 -1.929719 1.025079
C  -3.277459 -2.125721 1.560105
C  3.29795 -2.138055 -1.183004
C  -2.488906 -0.901829 -0.357421
C  2.671344 -1.039197 0.869727
C  -4.514864 3.107324 -1.065022
C  -5.885602 1.778436 2.992372
C  6.720053 1.401779 -2.141846
C  2.936988 3.212335 -0.252528
H  -2.115891 -3.83283 2.12365
H  2.050373 -3.772531 -1.781987
H  -0.742677 -1.674725 -1.308471
H  0.974334 -1.84777 1.88517
H  -3.991724 -2.24209 2.364418
H  3.945714 -2.203849 -2.046395
H  -2.593069 -0.086408 -1.060445
H  2.849562 -0.266655 1.605057
H  -5.341754 3.709711 -0.686422
H  -4.5584 3.086366 -2.15088
H  -3.570815 3.553168 -0.747789
H  -5.095605 2.362223 3.467009
H  -6.850114 2.232054 3.206583
H  -5.872587 0.764943 3.396413
H  7.053146 0.367476 -2.043719
H  6.292544 1.547529 -3.135005
H  7.574388 2.06214 -2.014684
H  2.344213 3.44954 0.627196
H  3.658499 4.011982 -0.425941
H  2.280467 3.125808 -1.119236
totalener: -2950.71113203 hartree
nucrepener: 3390.40731294 hartree
electener: -6341.11844496 hartree
twoeener: 4470.44448785 hartree
kineticenergy: 2942.64260854 hartree
xcener: -192.764146190221 hartree
chargesum: 0.0000000
charge: -0.038821 -0.386564 -0.398339 0.706296 0.726821 -0.317373 -0.336771 -0.315157 -0.317302 -0.311823 -0.318917 0.002100 -0.004051 0.220503 0.239588 -0.123319 -0.114294 -0.100161 -0.084906 -0.146034 -0.145225 -0.120083 -0.157467 -0.126570 -0.122450 -0.123244 -0.119977 0.114771 0.117070 0.127782 0.124642 0.116945 0.118778 0.119671 0.130438 0.117718 0.118067 0.108577 0.109866 0.116483 0.111055 0.114509 0.109198 0.116394 0.116122 0.113682 0.111770
qa: -0.0388 -0.3866 -0.3983 0.7063 0.7268 -0.3174 -0.3368 -0.3152 -0.3173 -0.3118 -0.3189 0.0021 -0.0041 0.2205 0.2396 -0.1233 -0.1143 -0.1002 -0.0849 -0.1460 -0.1452 -0.1201 -0.1575 -0.1266 -0.1225 -0.1232 -0.1200 0.1148 0.1171 0.1278 0.1246 0.1169 0.1188 0.1197 0.1304 0.1177 0.1181 0.1086 0.1099 0.1165 0.1111 0.1145 0.1092 0.1164 0.1161 0.1137 0.1118
va: 2.3156 2.0495 2.0430 5.5274 5.5244 2.1449 2.1228 2.1123 2.1199 2.1219 2.1302 3.8385 3.8307 3.8373 3.8084 4.0036 3.9851 3.9645 3.9336 4.0457 4.0586 3.9789 4.0551 3.8608 3.8700 3.8668 3.8673 1.0197 1.0190 1.0001 1.0010 1.0095 1.0138 1.0188 1.0129 0.9904 0.9906 1.0053 1.0057 0.9909 0.9877 0.9875 1.0055 0.9910 0.9912 0.9874 1.0052
dispcorr: -0.023681907 hartree
energy: -2950.734813932659
dipole: -1.68826 1.40825 -0.28001 11.28525 -10.20110 1.08415 0.54988 -0.29156 0.25833
magnitude: 1.14914 au
magnitude: 2.92088 debye
