program: Orca
programVersion: 5.0.2
elementType: S S S P P O O O O O O C C C C C C C C C C C C C C C C H H H H H H H H H H H H H H H H H H H H
charge: 0
multiplicity: 1
keywords: wb97x-d3
keywords: def2-TZVPP
keywords: def2/J RIJCOSX
keywords: DEFGRID2
keywords: scfconv7
keywords: smallprint printgap noloewdin
keywords: NOSOSCF
formula: C16H20O6P2S3
InChI: InChI=1/C16H20O6P2S3/c1-17-23(25,18-2)21-13-5-9-15(10-6-13)27-16-11-7-14(8-12-16)22-24(26,19-3)20-4/h5-12H,1-4H3
47 atoms
S  -0.077423 -3.280622 -0.631594
S  -6.492989 -0.368838 -0.882982
S  7.215462 1.402654 0.675944
P  -5.456079 0.976142 -0.004279
P  5.401692 0.979026 0.281758
O  -4.330755 0.474784 1.039793
O  5.104356 -0.60503 0.316782
O  -6.251294 2.005491 0.917812
O  -4.589361 1.948081 -0.92489
O  4.263397 1.515576 1.262492
O  4.843366 1.484267 -1.136705
C  -1.299594 -2.112541 -0.112197
C  1.432724 -2.410064 -0.338673
C  -3.337301 -0.389575 0.632791
C  3.865114 -1.157207 0.089274
C  -2.532429 -2.614761 0.293065
C  1.825373 -2.063587 0.951461
C  -1.098062 -0.736898 -0.142215
C  2.271469 -2.127111 -1.408454
C  -3.556933 -1.75597 0.653865
C  3.031361 -1.422594 1.16643
C  -2.11362 0.124225 0.236747
C  3.493767 -1.506397 -1.196682
C  -7.318842 1.574294 1.752514
C  -5.047006 2.365441 -2.20531
C  4.216076 2.891787 1.619711
C  5.69408 1.560415 -2.273591
H  -2.696776 -3.684078 0.330101
H  1.179394 -2.292737 1.788487
H  -0.147922 -0.329666 -0.460555
H  1.966892 -2.391328 -2.412215
H  -4.517965 -2.146019 0.959313
H  3.340028 -1.152068 2.166676
H  -1.956923 1.194292 0.220596
H  4.155444 -1.307061 -2.028691
H  -6.945338 0.997646 2.599781
H  -8.036902 0.970225 1.196768
H  -7.809405 2.470894 2.12265
H  -5.845518 3.102583 -2.113625
H  -4.197817 2.821342 -2.707869
H  -5.405744 1.519688 -2.792491
H  3.49208 2.983782 2.425222
H  5.189277 3.241152 1.967356
H  3.892437 3.504125 0.777272
H  6.022507 0.571035 -2.597505
H  5.111407 2.017624 -3.069533
H  6.574809 2.168945 -2.067323
totalener: -2950.70917235 hartree
nucrepener: 3293.51766537 hartree
electener: -6244.22683772 hartree
twoeener: 4372.90888430 hartree
kineticenergy: 2942.65414061 hartree
xcener: -192.767015123914 hartree
chargesum: -0.0000000
charge: -0.020763 -0.398988 -0.360861 0.724811 0.676535 -0.336741 -0.319172 -0.312036 -0.319089 -0.304630 -0.321348 0.033620 0.001667 0.230352 0.255495 -0.128858 -0.113408 -0.120428 -0.126410 -0.141708 -0.137626 -0.171457 -0.140639 -0.122525 -0.120287 -0.124102 -0.122030 0.112062 0.132748 0.127869 0.119984 0.121965 0.123928 0.124770 0.115177 0.115284 0.109550 0.115868 0.114783 0.111789 0.114386 0.114502 0.109391 0.113385 0.103974 0.119843 0.119368
qa: -0.0208 -0.3990 -0.3609 0.7248 0.6765 -0.3367 -0.3192 -0.3120 -0.3191 -0.3046 -0.3213 0.0336 0.0017 0.2304 0.2555 -0.1289 -0.1134 -0.1204 -0.1264 -0.1417 -0.1376 -0.1715 -0.1406 -0.1225 -0.1203 -0.1241 -0.1220 0.1121 0.1327 0.1279 0.1200 0.1220 0.1239 0.1248 0.1152 0.1153 0.1096 0.1159 0.1148 0.1118 0.1144 0.1145 0.1094 0.1134 0.1040 0.1198 0.1194
va: 2.3709 2.0426 2.0927 5.5259 5.5433 2.1247 2.1498 2.1206 2.1257 2.1155 2.0614 3.8832 3.8580 3.8201 3.8213 3.9889 3.9491 3.9054 4.0259 4.0644 4.0173 4.0752 4.0575 3.8653 3.8701 3.8720 3.8647 1.0170 1.0009 0.9991 1.0206 1.0160 1.0115 1.0147 1.0046 0.9871 1.0058 0.9908 0.9872 0.9914 1.0044 0.9908 1.0037 0.9893 0.9864 0.9893 1.0096
dispcorr: -0.023244219 hartree
energy: -2950.732416568366
dipole: -5.89163 5.18785 -0.70378 11.99465 -10.59623 1.39842 -3.60371 3.23549 -0.36822
magnitude: 1.60825 au
magnitude: 4.08785 debye
