program: Orca
programVersion: 5.0.2
elementType: S S S P P O O O O O O C C C C C C C C C C C C C C C C H H H H H H H H H H H H H H H H H H H H
charge: 0
multiplicity: 1
keywords: wb97x-d3
keywords: def2-TZVPP
keywords: def2/J RIJCOSX
keywords: DEFGRID2
keywords: scfconv7
keywords: smallprint printgap noloewdin
keywords: NOSOSCF
formula: C16H20O6P2S3
InChI: InChI=1/C16H20O6P2S3/c1-17-23(25,18-2)21-13-5-9-15(10-6-13)27-16-11-7-14(8-12-16)22-24(26,19-3)20-4/h5-12H,1-4H3
47 atoms
S  -0.011469 -3.179754 -0.676034
S  -6.382105 -0.395044 -1.141766
S  7.277031 1.429445 0.851062
P  -5.525435 0.936581 -0.071987
P  5.507003 0.974933 0.317012
O  -4.399355 0.428139 0.968897
O  5.148396 -0.577267 0.569655
O  -6.454942 1.787456 0.907361
O  -4.72414 2.085097 -0.835855
O  4.278577 1.684137 1.050039
O  5.140575 1.250095 -1.222298
C  -1.270358 -2.050303 -0.161033
C  1.485114 -2.321505 -0.294179
C  -3.373027 -0.395735 0.561832
C  3.920199 -1.122818 0.267165
C  -2.462284 -2.591921 0.309265
C  1.741269 -1.816477 0.978024
C  -1.143354 -0.669422 -0.270414
C  2.463396 -2.228623 -1.275612
C  -3.521025 -1.768297 0.654499
C  2.94771 -1.199846 1.254134
C  -2.188622 0.158647 0.101913
C  3.687606 -1.640539 -0.994304
C  -7.495273 1.162666 1.650146
C  -5.225273 2.651255 -2.040773
C  4.230219 3.101381 1.160931
C  6.118869 1.114058 -2.24512
H  -2.566928 -3.664644 0.407826
H  0.990965 -1.899651 1.753119
H  -0.22616 -0.234034 -0.643861
H  2.267286 -2.612787 -2.267795
H  -4.451782 -2.190279 1.00787
H  3.147852 -0.802528 2.239679
H  -2.086809 1.233015 0.030336
H  4.454155 -1.591037 -1.755787
H  -8.13424 0.558429 1.00486
H  -8.082691 1.959572 2.09902
H  -7.088301 0.532346 2.442312
H  -6.100121 3.273069 -1.847274
H  -4.431596 3.272409 -2.447757
H  -5.487461 1.876973 -2.762091
H  4.043368 3.564871 0.191352
H  3.408021 3.33676 1.831913
H  5.159232 3.495018 1.576449
H  5.656748 1.457775 -3.167398
H  7.001891 1.716206 -2.030201
H  6.428059 0.074517 -2.369483
totalener: -2950.70934874 hartree
nucrepener: 3283.95421577 hartree
electener: -6234.66356450 hartree
twoeener: 4363.35279327 hartree
kineticenergy: 2942.63255256 hartree
xcener: -192.762699848207 hartree
chargesum: 0.0000000
charge: -0.011497 -0.393114 -0.361858 0.722778 0.678420 -0.337581 -0.320317 -0.311884 -0.320618 -0.304114 -0.321421 0.020810 0.006118 0.219328 0.242850 -0.121201 -0.124972 -0.128064 -0.132911 -0.134361 -0.135288 -0.151379 -0.135102 -0.122559 -0.122581 -0.125158 -0.122437 0.114052 0.135684 0.132281 0.118657 0.119137 0.124241 0.128061 0.114606 0.109137 0.116683 0.114198 0.114437 0.112724 0.114033 0.113481 0.114186 0.109668 0.119683 0.119465 0.103701
qa: -0.0115 -0.3931 -0.3619 0.7228 0.6784 -0.3376 -0.3203 -0.3119 -0.3206 -0.3041 -0.3214 0.0208 0.0061 0.2193 0.2428 -0.1212 -0.1250 -0.1281 -0.1329 -0.1344 -0.1353 -0.1514 -0.1351 -0.1226 -0.1226 -0.1252 -0.1224 0.1141 0.1357 0.1323 0.1187 0.1191 0.1242 0.1281 0.1146 0.1091 0.1167 0.1142 0.1144 0.1127 0.1140 0.1135 0.1142 0.1097 0.1197 0.1195 0.1037
va: 2.3885 2.0478 2.0926 5.5268 5.5411 2.1229 2.1484 2.1185 2.1259 2.1152 2.0608 3.8699 3.8527 3.8366 3.8305 3.9873 3.9394 3.9297 4.0294 4.0627 4.0157 4.0589 4.0585 3.8672 3.8728 3.8736 3.8647 1.0177 0.9963 0.9961 1.0210 1.0137 1.0110 1.0139 1.0035 1.0054 0.9911 0.9874 0.9877 0.9911 1.0034 0.9893 0.9908 1.0029 0.9890 1.0101 0.9863
dispcorr: -0.023251924 hartree
energy: -2950.732600661355
dipole: -5.90617 5.06537 -0.84080 11.16891 -9.88775 1.28116 -4.24812 3.80458 -0.44354
magnitude: 1.59532 au
magnitude: 4.05498 debye
