program: Orca
programVersion: 5.0.2
elementType: S S S P P O O O O O O C C C C C C C C C C C C C C C C H H H H H H H H H H H H H H H H H H H H
charge: 0
multiplicity: 1
keywords: wb97x-d3
keywords: def2-TZVPP
keywords: def2/J RIJCOSX
keywords: DEFGRID2
keywords: scfconv7
keywords: smallprint printgap noloewdin
keywords: NOSOSCF
formula: C16H20O6P2S3
InChI: InChI=1/C16H20O6P2S3/c1-17-23(25,18-2)21-13-5-9-15(10-6-13)27-16-11-7-14(8-12-16)22-24(26,19-3)20-4/h5-12H,1-4H3
47 atoms
S  -0.066252 -2.526095 -0.639265
S  -6.879266 -0.858005 0.342387
S  6.887749 -1.169684 -0.708258
P  -6.041424 0.856221 0.223391
P  6.149489 0.435286 -0.002283
O  -4.56543 1.002808 0.86436
O  4.720427 0.941855 -0.574017
O  -6.778348 2.067555 0.954143
O  -5.785437 1.445689 -1.234957
O  5.832687 0.446291 1.573346
O  7.029727 1.731651 -0.282651
C  -1.380758 -1.432572 -0.186117
C  1.340214 -1.454529 -0.599561
C  -3.533285 0.171383 0.492905
C  3.618154 0.118773 -0.56651
C  -1.553765 -0.196125 -0.80169
C  1.567702 -0.575492 0.455288
C  -2.298494 -1.857803 0.765909
C  2.268044 -1.542694 -1.630426
C  -2.623391 0.610654 -0.457561
C  2.700348 0.219006 0.468384
C  -3.385353 -1.063444 1.099172
C  3.417538 -0.768114 -1.609759
C  -7.440951 1.882861 2.198878
C  -6.683297 1.200343 -2.31118
C  6.50881 -0.42104 2.476709
C  6.634312 3.036823 0.12772
H  -0.847836 0.138633 -1.550159
H  0.854607 -0.505188 1.265903
H  -2.162472 -2.812926 1.255794
H  2.091476 -2.21675 -2.4582
H  -2.757934 1.575628 -0.927241
H  2.87532 0.911354 1.280749
H  -4.104364 -1.395764 1.8350
H  4.144621 -0.840103 -2.406836
H  -6.726045 1.706645 3.003668
H  -8.140596 1.047699 2.15449
H  -7.984322 2.802124 2.401837
H  -6.937183 0.142493 -2.381432
H  -7.598141 1.782712 -2.197342
H  -6.174117 1.512335 -3.219594
H  6.41669 -1.461116 2.166891
H  7.567031 -0.170858 2.557186
H  6.03714 -0.286758 3.446814
H  6.342001 3.062812 1.178367
H  7.498905 3.681052 -0.011811
H  5.811681 3.408533 -0.482697
totalener: -2950.70939987 hartree
nucrepener: 3246.76103410 hartree
electener: -6197.47043397 hartree
twoeener: 4326.54761397 hartree
kineticenergy: 2942.64465321 hartree
xcener: -192.765505968115 hartree
chargesum: -0.0000000
charge: -0.018360 -0.397935 -0.358217 0.723036 0.699298 -0.335170 -0.347050 -0.311121 -0.318334 -0.334038 -0.301735 -0.007516 -0.003113 0.242238 0.241628 -0.097217 -0.100395 -0.113752 -0.113096 -0.166406 -0.167921 -0.144448 -0.144962 -0.122490 -0.120779 -0.117686 -0.129749 0.130123 0.129737 0.118191 0.117643 0.126992 0.120877 0.122490 0.127609 0.113630 0.111311 0.116570 0.114693 0.113855 0.114236 0.116951 0.116522 0.113090 0.106921 0.119167 0.114683
qa: -0.0184 -0.3979 -0.3582 0.7230 0.6993 -0.3352 -0.3471 -0.3111 -0.3183 -0.3340 -0.3017 -0.0075 -0.0031 0.2422 0.2416 -0.0972 -0.1004 -0.1138 -0.1131 -0.1664 -0.1679 -0.1444 -0.1450 -0.1225 -0.1208 -0.1177 -0.1297 0.1301 0.1297 0.1182 0.1176 0.1270 0.1209 0.1225 0.1276 0.1136 0.1113 0.1166 0.1147 0.1139 0.1142 0.1170 0.1165 0.1131 0.1069 0.1192 0.1147
va: 2.3615 2.0419 2.0957 5.5244 5.5192 2.1266 2.0935 2.1188 2.1277 2.0530 2.1309 3.8479 3.8482 3.8122 3.8006 3.9208 3.9204 3.9967 3.9918 4.0629 4.0650 4.0607 4.0737 3.8665 3.8696 3.8664 3.8865 0.9969 0.9966 1.0194 1.0188 1.0126 1.0145 1.0164 1.0126 0.9871 1.0044 0.9912 1.0037 0.9872 0.9910 1.0042 0.9880 0.9919 0.9937 0.9899 0.9902
dispcorr: -0.023064464 hartree
energy: -2950.732464332272
dipole: -3.45752 2.90536 -0.55217 10.30016 -8.54091 1.75925 6.28180 -5.34013 0.94168
magnitude: 2.07041 au
magnitude: 5.26256 debye
