program: Orca
programVersion: 5.0.2
elementType: S S S P P O O O O O O C C C C C C C C C C C C C C C C H H H H H H H H H H H H H H H H H H H H
charge: 0
multiplicity: 1
keywords: wb97x-d3
keywords: def2-TZVPP
keywords: def2/J RIJCOSX
keywords: DEFGRID2
keywords: scfconv7
keywords: smallprint printgap noloewdin
keywords: NOSOSCF
formula: C16H20O6P2S3
InChI: InChI=1/C16H20O6P2S3/c1-17-23(25,18-2)21-13-5-9-15(10-6-13)27-16-11-7-14(8-12-16)22-24(26,19-3)20-4/h5-12H,1-4H3
47 atoms
S  -0.08329 -2.573893 -0.218427
S  -7.178682 2.357072 1.009512
S  5.588481 1.062298 -2.660501
P  -5.965757 0.889923 0.974153
P  6.036766 0.558579 -0.870518
O  -4.599794 1.224356 0.185122
O  4.858395 0.638899 0.232031
O  -6.514689 -0.470279 0.321115
O  -5.380044 0.339806 2.35269
O  6.561279 -0.928416 -0.641437
O  7.157435 1.421926 -0.135636
C  -1.39392 -1.392494 -0.101277
C  1.356674 -1.556154 -0.075803
C  -3.553868 0.330972 0.102977
C  3.701829 -0.096345 0.100434
C  -1.445447 -0.45191 0.923639
C  2.388476 -1.986733 0.749635
C  -2.429402 -1.454596 -1.024632
C  1.508702 -0.384565 -0.8114
C  -2.517531 0.414958 1.021351
C  3.570571 -1.266891 0.826552
C  -3.517869 -0.601586 -0.917759
C  2.674452 0.354841 -0.715155
C  -7.461702 -0.452459 -0.738135
C  -6.259295 -0.082392 3.387837
C  7.352791 -1.598367 -1.615429
C  7.196569 2.838946 -0.257803
H  -0.643516 -0.397332 1.647797
H  2.268407 -2.887789 1.336749
H  -2.384567 -2.169871 -1.835297
H  0.712692 -0.045431 -1.46099
H  -2.558374 1.150496 1.813009
H  4.378222 -1.600504 1.463847
H  -4.317664 -0.647807 -1.644386
H  2.79472 1.267117 -1.282958
H  -7.039567 -0.021864 -1.647891
H  -8.350471 0.11585 -0.463786
H  -7.734217 -1.487329 -0.930763
H  -6.762177 -1.012246 3.119978
H  -5.648801 -0.250942 4.271234
H  -7.005951 0.682801 3.607013
H  6.912549 -1.51403 -2.609264
H  8.366824 -1.197416 -1.637193
H  7.389157 -2.644249 -1.321782
H  8.146214 3.164291 0.159842
H  7.134193 3.148429 -1.302195
H  6.383819 3.303226 0.302619
totalener: -2950.70893441 hartree
nucrepener: 3244.49261283 hartree
electener: -6195.20154724 hartree
twoeener: 4324.15449065 hartree
kineticenergy: 2942.64698576 hartree
xcener: -192.764848512817 hartree
chargesum: 0.0000000
charge: -0.024894 -0.361754 -0.398559 0.677577 0.723651 -0.321316 -0.336119 -0.322282 -0.301893 -0.315709 -0.311081 0.001980 -0.003612 0.240742 0.241782 -0.097318 -0.109614 -0.139718 -0.104392 -0.150691 -0.162263 -0.130559 -0.151759 -0.122900 -0.124785 -0.120665 -0.122042 0.130740 0.116407 0.117034 0.130918 0.123245 0.124090 0.113467 0.128339 0.105678 0.118850 0.119355 0.114358 0.114094 0.108110 0.114658 0.113996 0.113861 0.116127 0.109039 0.115826
qa: -0.0249 -0.3618 -0.3986 0.6776 0.7237 -0.3213 -0.3361 -0.3223 -0.3019 -0.3157 -0.3111 0.0020 -0.0036 0.2407 0.2418 -0.0973 -0.1096 -0.1397 -0.1044 -0.1507 -0.1623 -0.1306 -0.1518 -0.1229 -0.1248 -0.1207 -0.1220 0.1307 0.1164 0.1170 0.1309 0.1232 0.1241 0.1135 0.1283 0.1057 0.1189 0.1194 0.1144 0.1141 0.1081 0.1147 0.1140 0.1139 0.1161 0.1090 0.1158
va: 2.3531 2.0941 2.0423 5.5446 5.5242 2.1454 2.1268 2.0591 2.1158 2.1268 2.1224 3.8483 3.8467 3.8309 3.8120 3.9190 3.9659 4.0207 3.9478 4.0266 4.0809 4.0652 4.0468 3.8639 3.8739 3.8688 3.8646 0.9971 1.0190 1.0208 0.9973 1.0109 1.0125 1.0037 1.0162 0.9865 1.0097 0.9892 0.9902 0.9912 1.0025 1.0039 0.9870 0.9912 0.9906 1.0055 0.9871
dispcorr: -0.023096181 hartree
energy: -2950.732030588125
dipole: 2.00425 -1.46455 0.53971 -4.71808 3.71284 -1.00524 1.76850 -1.28038 0.48812
magnitude: 1.24099 au
magnitude: 3.15434 debye
