program: Orca
programVersion: 5.0.2
elementType: S S S P P O O O O O O C C C C C C C C C C C C C C C C H H H H H H H H H H H H H H H H H H H H
charge: 0
multiplicity: 1
keywords: wb97x-d3
keywords: def2-TZVPP
keywords: def2/J RIJCOSX
keywords: DEFGRID2
keywords: scfconv7
keywords: smallprint printgap noloewdin
keywords: NOSOSCF
formula: C16H20O6P2S3
InChI: InChI=1/C16H20O6P2S3/c1-17-23(25,18-2)21-13-5-9-15(10-6-13)27-16-11-7-14(8-12-16)22-24(26,19-3)20-4/h5-12H,1-4H3
47 atoms
S  -0.068057 -3.120577 -0.901611
S  -6.688141 -0.700197 0.047332
S  4.933738 1.668937 -2.089531
P  -5.604277 0.713175 0.714006
P  5.401735 1.105036 -0.323728
O  -4.227375 0.337571 1.477489
O  5.112337 -0.439263 0.04885
O  -6.312972 1.584275 1.843145
O  -5.031964 1.757809 -0.365921
O  6.939564 1.212503 0.085223
O  4.684829 1.841153 0.895768
C  -1.273726 -2.045542 -0.183133
C  1.443067 -2.254014 -0.600772
C  -3.268705 -0.456004 0.891516
C  3.885944 -1.020368 -0.182496
C  -1.240423 -0.665632 -0.36241
C  1.758778 -1.733624 0.65133
C  -2.319794 -2.619389 0.52977
C  2.365563 -2.15648 -1.635183
C  -2.230326 0.131418 0.184307
C  2.970186 -1.098284 0.856264
C  -3.329467 -1.828367 1.054537
C  3.594053 -1.548357 -1.427381
C  -5.654086 2.64612 2.52698
C  -5.739668 2.052872 -1.564298
C  7.966407 0.823415 -0.819438
C  4.467548 3.247027 0.880858
H  -0.43624 -0.209908 -0.924695
H  1.05152 -1.81591 1.465954
H  -2.34522 -3.690374 0.681821
H  2.119352 -2.545227 -2.614421
H  -2.201034 1.20509 0.057417
H  3.217666 -0.684794 1.824658
H  -4.148522 -2.271999 1.603692
H  4.31015 -1.467646 -2.233291
H  -5.168207 3.337349 1.836604
H  -4.913913 2.262859 3.229178
H  -6.421153 3.183707 3.079116
H  -6.610847 2.678553 -1.365305
H  -5.052083 2.595558 -2.208372
H  -6.065636 1.141479 -2.064934
H  7.826853 1.284114 -1.798381
H  8.906948 1.160697 -0.391359
H  7.996955 -0.260972 -0.93402
H  3.789662 3.468586 1.701223
H  5.402056 3.787909 1.034877
H  4.017626 3.567796 -0.059432
totalener: -2950.70967856 hartree
nucrepener: 3288.13090665 hartree
electener: -6238.84058522 hartree
twoeener: 4367.84008554 hartree
kineticenergy: 2942.64352001 hartree
xcener: -192.765070923297 hartree
chargesum: -0.0000000
charge: -0.014395 -0.358102 -0.398148 0.698971 0.725747 -0.347275 -0.337799 -0.301947 -0.331333 -0.311208 -0.317079 0.002592 -0.005350 0.235987 0.242742 -0.114507 -0.108209 -0.109758 -0.111306 -0.160302 -0.161970 -0.147516 -0.142946 -0.129222 -0.114380 -0.123025 -0.122910 0.135232 0.131862 0.117165 0.118059 0.122034 0.127712 0.127093 0.121797 0.106432 0.113792 0.119183 0.112803 0.111240 0.116505 0.109786 0.116686 0.115395 0.113474 0.114500 0.111897
qa: -0.0144 -0.3581 -0.3981 0.6990 0.7257 -0.3473 -0.3378 -0.3019 -0.3313 -0.3112 -0.3171 0.0026 -0.0053 0.2360 0.2427 -0.1145 -0.1082 -0.1098 -0.1113 -0.1603 -0.1620 -0.1475 -0.1429 -0.1292 -0.1144 -0.1230 -0.1229 0.1352 0.1319 0.1172 0.1181 0.1220 0.1277 0.1271 0.1218 0.1064 0.1138 0.1192 0.1128 0.1112 0.1165 0.1098 0.1167 0.1154 0.1135 0.1145 0.1119
va: 2.3772 2.1004 2.0426 5.5246 5.5265 2.0952 2.1248 2.1283 2.0576 2.1200 2.1317 3.8552 3.8504 3.8087 3.8100 3.9284 3.9259 3.9854 3.9949 4.0609 4.0627 4.0783 4.0584 3.8879 3.8661 3.8650 3.8713 0.9954 0.9967 1.0184 1.0189 1.0155 1.0124 1.0117 1.0161 0.9932 0.9904 0.9898 0.9866 0.9913 1.0083 1.0049 0.9909 0.9876 0.9909 0.9877 1.0042
dispcorr: -0.023217576 hartree
energy: -2950.732896139245
dipole: 5.19970 -4.09046 1.10924 14.13286 -12.39422 1.73864 1.85152 -1.28533 0.56619
magnitude: 2.13865 au
magnitude: 5.43603 debye
