program: Orca
programVersion: 5.0.2
elementType: S S S P P O O O O O O C C C C C C C C C C C C C C C C H H H H H H H H H H H H H H H H H H H H
charge: 0
multiplicity: 1
keywords: wb97x-d3
keywords: def2-TZVPP
keywords: def2/J RIJCOSX
keywords: DEFGRID2
keywords: scfconv7
keywords: smallprint printgap noloewdin
keywords: NOSOSCF
formula: C16H20O6P2S3
InChI: InChI=1/C16H20O6P2S3/c1-17-23(25,18-2)21-13-5-9-15(10-6-13)27-16-11-7-14(8-12-16)22-24(26,19-3)20-4/h5-12H,1-4H3
47 atoms
S  -0.062524 -3.130217 -0.914199
S  -6.677666 -0.717226 0.087023
S  4.92971 1.689064 -2.124443
P  -5.58958 0.699007 0.740626
P  5.399044 1.117273 -0.361524
O  -4.206659 0.326148 1.493777
O  5.113101 -0.42918 0.003984
O  -6.288984 1.573549 1.872562
O  -5.026899 1.741034 -0.347175
O  6.936849 1.224392 0.047377
O  4.681386 1.846392 0.86139
C  -1.265323 -2.056674 -0.188306
C  1.447343 -2.257531 -0.62351
C  -3.252336 -0.46749 0.901095
C  3.886785 -1.01261 -0.22092
C  -1.233377 -0.67675 -0.36756
C  1.775546 -1.750816 0.631056
C  -2.306262 -2.630819 0.531822
C  2.354956 -2.139365 -1.668727
C  -2.219467 0.120127 0.18612
C  2.985105 -1.109793 0.828604
C  -3.311893 -1.839855 1.064449
C  3.58205 -1.525487 -1.46903
C  -5.626432 2.641506 2.543228
C  -5.74162 2.024729 -1.544335
C  7.963857 0.842489 -0.860152
C  4.453521 3.250543 0.851215
H  -0.433337 -0.220865 -0.93555
H  1.079206 -1.848467 1.453361
H  -2.330626 -3.701856 0.683771
H  2.098362 -2.51711 -2.649588
H  -2.191448 1.193815 0.059009
H  3.242779 -0.707012 1.798873
H  -4.126907 -2.283463 1.619598
H  4.287234 -1.429531 -2.282848
H  -6.388748 3.17704 3.103863
H  -5.154155 3.332596 1.843343
H  -4.874446 2.265068 3.236511
H  -6.0469 1.107913 -2.048337
H  -6.626983 2.62982 -1.34364
H  -5.06621 2.585347 -2.186167
H  7.992599 -0.24073 -0.985933
H  7.82615 1.313512 -1.834421
H  8.904558 1.173543 -0.427538
H  3.778273 3.464673 1.675726
H  5.384623 3.798253 1.001779
H  3.996317 3.57036 -0.085891
totalener: -2950.70969036 hartree
nucrepener: 3288.65207247 hartree
electener: -6239.36176283 hartree
twoeener: 4368.36023621 hartree
kineticenergy: 2942.64496173 hartree
xcener: -192.765278219500 hartree
chargesum: 0.0000000
charge: -0.015422 -0.357979 -0.398398 0.698842 0.725717 -0.347241 -0.337549 -0.301826 -0.331742 -0.311056 -0.316940 0.002081 -0.007287 0.236642 0.244504 -0.112609 -0.104986 -0.109952 -0.111280 -0.161689 -0.163618 -0.147687 -0.143486 -0.129275 -0.115139 -0.123125 -0.122943 0.134866 0.131701 0.117052 0.118220 0.121948 0.127413 0.127117 0.122070 0.119218 0.106449 0.113840 0.116903 0.113228 0.111309 0.115400 0.109837 0.116792 0.113562 0.114449 0.112071
qa: -0.0154 -0.3580 -0.3984 0.6988 0.7257 -0.3472 -0.3375 -0.3018 -0.3317 -0.3111 -0.3169 0.0021 -0.0073 0.2366 0.2445 -0.1126 -0.1050 -0.1100 -0.1113 -0.1617 -0.1636 -0.1477 -0.1435 -0.1293 -0.1151 -0.1231 -0.1229 0.1349 0.1317 0.1171 0.1182 0.1219 0.1274 0.1271 0.1221 0.1192 0.1064 0.1138 0.1169 0.1132 0.1113 0.1154 0.1098 0.1168 0.1136 0.1144 0.1121
va: 2.3741 2.1003 2.0423 5.5245 5.5266 2.0952 2.1253 2.1285 2.0566 2.1201 2.1317 3.8548 3.8499 3.8074 3.8075 3.9263 3.9246 3.9853 3.9954 4.0620 4.0640 4.0785 4.0588 3.8877 3.8665 3.8652 3.8714 0.9955 0.9969 1.0184 1.0190 1.0155 1.0124 1.0118 1.0163 0.9898 0.9933 0.9904 1.0077 0.9867 0.9914 0.9876 1.0047 0.9909 0.9909 0.9876 1.0041
dispcorr: -0.023218307 hartree
energy: -2950.732908665367
dipole: 5.16055 -4.04868 1.11187 14.12093 -12.38231 1.73862 1.80082 -1.24466 0.55615
magnitude: 2.13737 au
magnitude: 5.43276 debye
