program: Orca
programVersion: 5.0.2
elementType: S S S P P O O O O O O C C C C C C C C C C C C C C C C H H H H H H H H H H H H H H H H H H H H
charge: 0
multiplicity: 1
keywords: wb97x-d3
keywords: def2-TZVPP
keywords: def2/J RIJCOSX
keywords: DEFGRID2
keywords: scfconv7
keywords: smallprint printgap noloewdin
keywords: NOSOSCF
formula: C16H20O6P2S3
InChI: InChI=1/C16H20O6P2S3/c1-17-23(25,18-2)21-13-5-9-15(10-6-13)27-16-11-7-14(8-12-16)22-24(26,19-3)20-4/h5-12H,1-4H3
47 atoms
S  -0.104471 -3.1126 -0.780512
S  -5.195617 1.900928 -1.200119
S  4.379777 2.265895 0.884578
P  -5.518004 1.025012 0.468719
P  5.456905 0.978059 -0.010909
O  -4.226665 0.562611 1.321047
O  5.144994 -0.591614 0.230961
O  -6.354784 -0.330796 0.431662
O  -6.29468 1.860781 1.582664
O  5.435076 1.012262 -1.617136
O  6.9919 1.024044 0.406969
C  -1.297438 -1.973284 -0.144151
C  1.424781 -2.282817 -0.465603
C  -3.271452 -0.278176 0.797371
C  3.900076 -1.126352 -0.011254
C  -2.322157 -2.468174 0.653141
C  1.686713 -1.639362 0.740399
C  -1.273606 -0.620827 -0.471933
C  2.415962 -2.343017 -1.438333
C  -3.321972 -1.624641 1.11157
C  2.916033 -1.045531 0.962691
C  -2.25103 0.232096 0.00861
C  3.658532 -1.771525 -1.21105
C  -7.434892 -0.504265 -0.479154
C  -5.943979 3.211911 1.857143
C  5.204778 2.221225 -2.330516
C  7.957411 0.106772 -0.099806
H  -2.337256 -3.516063 0.922323
H  0.924927 -1.592475 1.507116
H  -0.484212 -0.229449 -1.099623
H  2.214306 -2.828526 -2.384275
H  -4.121933 -2.00505 1.732031
H  3.119044 -0.534482 1.893707
H  -2.232174 1.284486 -0.238494
H  4.431186 -1.819563 -1.966365
H  -8.292651 0.103372 -0.188466
H  -7.712151 -1.554446 -0.43861
H  -7.139772 -0.244318 -1.496009
H  -5.913688 3.806451 0.942996
H  -6.709084 3.606983 2.520615
H  -4.975792 3.271543 2.356331
H  4.302689 2.720597 -1.977517
H  6.048051 2.906883 -2.235002
H  5.08509 1.948439 -3.376266
H  7.924312 0.040044 -1.188229
H  8.931862 0.485363 0.198748
H  7.816847 -0.887121 0.324512
totalener: -2950.70968764 hartree
nucrepener: 3286.59195558 hartree
electener: -6237.30164322 hartree
twoeener: 4366.55095952 hartree
kineticenergy: 2942.64441640 hartree
xcener: -192.765337137079 hartree
chargesum: -0.0000000
charge: -0.019229 -0.396835 -0.361375 0.724048 0.700365 -0.337360 -0.347614 -0.317013 -0.310441 -0.329973 -0.301497 -0.000881 -0.000541 0.240363 0.245972 -0.108592 -0.108152 -0.113692 -0.113006 -0.160545 -0.154830 -0.142224 -0.158837 -0.121968 -0.123177 -0.117809 -0.130461 0.117254 0.132071 0.133582 0.115499 0.125111 0.129611 0.126323 0.117954 0.114584 0.113912 0.113869 0.108478 0.116397 0.116322 0.116141 0.113992 0.112764 0.106614 0.119362 0.115464
qa: -0.0192 -0.3968 -0.3614 0.7240 0.7004 -0.3374 -0.3476 -0.3170 -0.3104 -0.3300 -0.3015 -0.0009 -0.0005 0.2404 0.2460 -0.1086 -0.1082 -0.1137 -0.1130 -0.1605 -0.1548 -0.1422 -0.1588 -0.1220 -0.1232 -0.1178 -0.1305 0.1173 0.1321 0.1336 0.1155 0.1251 0.1296 0.1263 0.1180 0.1146 0.1139 0.1139 0.1085 0.1164 0.1163 0.1161 0.1140 0.1128 0.1066 0.1194 0.1155
va: 2.3721 2.0450 2.0950 5.5270 5.5201 2.1246 2.0975 2.1292 2.1212 2.0574 2.1286 3.8448 3.8554 3.8127 3.7957 3.9733 3.9409 3.9592 3.9745 4.0843 4.0608 4.0452 4.0845 3.8704 3.8658 3.8682 3.8870 1.0188 0.9963 0.9962 1.0188 1.0127 1.0133 1.0159 1.0146 0.9870 0.9914 1.0039 1.0048 0.9908 0.9877 1.0066 0.9867 0.9914 0.9932 0.9898 0.9902
dispcorr: -0.023183518 hartree
energy: -2950.732871156382
dipole: 0.72684 -0.49179 0.23504 2.36253 -2.63608 -0.27354 -4.50162 3.99575 -0.50587
magnitude: 0.62127 au
magnitude: 1.57914 debye
