program: Orca
programVersion: 5.0.2
elementType: S S S P P O O O O O O C C C C C C C C C C C C C C C C H H H H H H H H H H H H H H H H H H H H
charge: 0
multiplicity: 1
keywords: wb97x-d3
keywords: def2-TZVPP
keywords: def2/J RIJCOSX
keywords: DEFGRID2
keywords: scfconv7
keywords: smallprint printgap noloewdin
keywords: NOSOSCF
formula: C16H20O6P2S3
InChI: InChI=1/C16H20O6P2S3/c1-17-23(25,18-2)21-13-5-9-15(10-6-13)27-16-11-7-14(8-12-16)22-24(26,19-3)20-4/h5-12H,1-4H3
47 atoms
S  -0.121881 -3.080094 -0.917017
S  -5.227064 1.927424 -1.163561
S  4.340827 2.246129 0.91065
P  -5.521703 1.029597 0.498805
P  5.430441 0.972108 0.01041
O  -4.214866 0.549363 1.316874
O  5.120981 -0.601309 0.228677
O  -6.364873 -0.322075 0.457001
O  -6.272416 1.849077 1.642065
O  5.423006 1.023899 -1.595818
O  6.96091 1.020383 0.444538
C  -1.311586 -1.957623 -0.245364
C  1.408707 -2.271354 -0.557266
C  -3.270368 -0.281441 0.759891
C  3.88008 -1.132647 -0.041872
C  -2.330415 -2.47002 0.548255
C  1.655769 -1.657755 0.667335
C  -1.286735 -0.597045 -0.53834
C  2.413457 -2.312585 -1.516961
C  -3.322627 -1.635585 1.039077
C  2.883331 -1.072688 0.920316
C  -2.256923 0.24592 -0.026718
C  3.654186 -1.750183 -1.259144
C  -7.446332 -0.491252 -0.452758
C  -5.920452 3.197501 1.927453
C  5.223582 2.246387 -2.295087
C  7.937651 0.115236 -0.061869
H  -2.346008 -3.524499 0.790162
H  0.883399 -1.625563 1.42416
H  -0.501627 -0.191602 -1.162513
H  2.22377 -2.774462 -2.477142
H  -4.117533 -2.029523 1.657557
H  3.074341 -0.582938 1.865212
H  -2.236959 1.304401 -0.246245
H  4.436818 -1.782706 -2.004894
H  -7.723635 -1.541553 -0.416144
H  -7.153119 -0.227064 -1.469067
H  -8.303776 0.115106 -0.15854
H  -5.89038 3.800116 1.01857
H  -6.684534 3.587863 2.594879
H  -4.951741 3.251317 2.426086
H  4.322088 2.753519 -1.951585
H  6.074572 2.918373 -2.17356
H  5.119884 1.991047 -3.346985
H  7.795939 -0.885686 0.34522
H  7.92064 0.064731 -1.151548
H  8.90595 0.493593 0.256457
totalener: -2950.70964741 hartree
nucrepener: 3288.16175889 hartree
electener: -6238.87140630 hartree
twoeener: 4368.12716876 hartree
kineticenergy: 2942.64469428 hartree
xcener: -192.765400233195 hartree
chargesum: 0.0000000
charge: -0.019989 -0.396829 -0.361243 0.723545 0.700105 -0.337089 -0.348014 -0.317632 -0.309939 -0.329457 -0.301491 -0.001887 0.000842 0.241263 0.246004 -0.107660 -0.108260 -0.112907 -0.113717 -0.161844 -0.155694 -0.141586 -0.158144 -0.121434 -0.122442 -0.118513 -0.130430 0.117551 0.131994 0.133605 0.115264 0.125373 0.129218 0.126217 0.117704 0.113788 0.114051 0.114619 0.107986 0.116270 0.116410 0.116519 0.113658 0.112757 0.115645 0.106483 0.119327
qa: -0.0200 -0.3968 -0.3612 0.7235 0.7001 -0.3371 -0.3480 -0.3176 -0.3099 -0.3295 -0.3015 -0.0019 0.0008 0.2413 0.2460 -0.1077 -0.1083 -0.1129 -0.1137 -0.1618 -0.1557 -0.1416 -0.1581 -0.1214 -0.1224 -0.1185 -0.1304 0.1176 0.1320 0.1336 0.1153 0.1254 0.1292 0.1262 0.1177 0.1138 0.1141 0.1146 0.1080 0.1163 0.1164 0.1165 0.1137 0.1128 0.1156 0.1065 0.1193
va: 2.3703 2.0447 2.0957 5.5274 5.5210 2.1246 2.0975 2.1281 2.1221 2.0575 2.1282 3.8440 3.8557 3.8129 3.7954 3.9739 3.9373 3.9594 3.9752 4.0835 4.0616 4.0451 4.0845 3.8701 3.8648 3.8691 3.8869 1.0188 0.9962 0.9965 1.0187 1.0128 1.0133 1.0157 1.0149 0.9914 1.0038 0.9869 1.0053 0.9907 0.9878 1.0064 0.9866 0.9914 0.9902 0.9931 0.9898
dispcorr: -0.023221889 hartree
energy: -2950.732869299491
dipole: 0.94851 -0.68935 0.25915 2.43007 -2.69247 -0.26240 -4.31786 3.82473 -0.49313
magnitude: 0.61579 au
magnitude: 1.56520 debye
