program: Orca
programVersion: 5.0.2
elementType: S S S P P O O O O O O C C C C C C C C C C C C C C C C H H H H H H H H H H H H H H H H H H H H
charge: 0
multiplicity: 1
keywords: wb97x-d3
keywords: def2-TZVPP
keywords: def2/J RIJCOSX
keywords: DEFGRID2
keywords: scfconv7
keywords: smallprint printgap noloewdin
keywords: NOSOSCF
formula: C16H20O6P2S3
InChI: InChI=1/C16H20O6P2S3/c1-17-23(25,18-2)21-13-5-9-15(10-6-13)27-16-11-7-14(8-12-16)22-24(26,19-3)20-4/h5-12H,1-4H3
47 atoms
S  0.035217 -3.487662 -0.425017
S  -6.341876 2.104358 1.733354
S  3.575745 2.275839 -0.224318
P  -5.234077 0.940636 0.712411
P  5.08125 1.169268 -0.623092
O  -3.934556 0.443825 1.525126
O  5.032842 -0.348339 -0.069128
O  -4.670307 1.532149 -0.669598
O  -5.830432 -0.453803 0.218851
O  5.413673 0.911733 -2.161278
O  6.498235 1.635061 -0.058865
C  -1.143199 -2.288072 0.129454
C  1.536946 -2.560179 -0.297706
C  -3.035506 -0.468031 1.016805
C  3.876423 -1.089849 -0.152011
C  -2.181995 -2.702869 0.954217
C  2.409701 -2.527341 -1.377067
C  -1.067546 -0.953634 -0.256795
C  1.861944 -1.875224 0.87014
C  -3.139142 -1.797648 1.385451
C  3.589289 -1.799767 -1.304145
C  -2.002177 -0.041429 0.197561
C  3.018864 -1.122961 0.937068
C  -4.285271 2.896993 -0.769824
C  -7.108847 -0.51296 -0.402305
C  5.274181 1.946529 -3.127983
C  6.620985 2.112153 1.276127
H  -2.23957 -3.735381 1.273314
H  2.158824 -3.053611 -2.288582
H  -0.265424 -0.616811 -0.899662
H  1.19265 -1.90701 1.719466
H  -3.945675 -2.117782 2.03086
H  4.269264 -1.769564 -2.144665
H  -1.916882 1.000347 -0.079321
H  3.259337 -0.563869 1.830907
H  -3.429653 3.12206 -0.129817
H  -5.107486 3.559265 -0.49728
H  -4.005349 3.068456 -1.80636
H  -7.380699 -1.563537 -0.464313
H  -7.857426 0.019881 0.186141
H  -7.07553 -0.092804 -1.408193
H  6.078136 2.67764 -3.035724
H  5.333925 1.473382 -4.104838
H  4.314182 2.454258 -3.027945
H  7.631593 2.498899 1.37979
H  5.903593 2.908473 1.478948
H  6.473783 1.305641 1.996331
totalener: -2950.70902214 hartree
nucrepener: 3324.66211196 hartree
electener: -6275.37113410 hartree
twoeener: 4404.29619228 hartree
kineticenergy: 2942.66175524 hartree
xcener: -192.767654363791 hartree
chargesum: 0.0000000
charge: -0.023831 -0.368348 -0.395805 0.681152 0.725222 -0.321187 -0.338009 -0.318312 -0.301427 -0.320154 -0.310928 0.017410 0.007623 0.238134 0.231273 -0.120105 -0.122314 -0.143231 -0.108495 -0.145033 -0.145648 -0.128302 -0.140861 -0.128302 -0.125861 -0.120947 -0.124241 0.115714 0.117563 0.132494 0.131552 0.121042 0.131650 0.116432 0.119108 0.105898 0.119609 0.120494 0.113871 0.109335 0.114020 0.115774 0.113320 0.110817 0.117768 0.110468 0.113598
qa: -0.0238 -0.3683 -0.3958 0.6812 0.7252 -0.3212 -0.3380 -0.3183 -0.3014 -0.3202 -0.3109 0.0174 0.0076 0.2381 0.2313 -0.1201 -0.1223 -0.1432 -0.1085 -0.1450 -0.1456 -0.1283 -0.1409 -0.1283 -0.1259 -0.1209 -0.1242 0.1157 0.1176 0.1325 0.1316 0.1210 0.1317 0.1164 0.1191 0.1059 0.1196 0.1205 0.1139 0.1093 0.1140 0.1158 0.1133 0.1108 0.1178 0.1105 0.1136
va: 2.3561 2.0887 2.0429 5.5435 5.5243 2.1453 2.1192 2.0669 2.1176 2.1280 2.1232 3.8338 3.8282 3.8218 3.8179 3.9763 4.0029 3.9843 3.9399 4.0531 4.0672 4.0481 4.0292 3.8669 3.8738 3.8683 3.8691 1.0177 1.0191 0.9986 0.9975 1.0100 1.0114 1.0020 1.0110 0.9851 1.0095 0.9886 0.9907 1.0035 0.9888 0.9880 0.9908 1.0053 0.9915 1.0035 0.9878
dispcorr: -0.023738873 hartree
energy: -2950.732761013441
dipole: 3.36100 -2.36207 0.99893 5.96017 -5.80377 0.15640 -7.58843 6.43713 -1.15131
magnitude: 1.53226 au
magnitude: 3.89470 debye
