program: Orca
programVersion: 5.0.2
elementType: S S S P P O O O O O O C C C C C C C C C C C C C C C C H H H H H H H H H H H H H H H H H H H H
charge: 0
multiplicity: 1
keywords: wb97x-d3
keywords: def2-TZVPP
keywords: def2/J RIJCOSX
keywords: DEFGRID2
keywords: scfconv7
keywords: smallprint printgap noloewdin
keywords: NOSOSCF
formula: C16H20O6P2S3
InChI: InChI=1/C16H20O6P2S3/c1-17-23(25,18-2)21-13-5-9-15(10-6-13)27-16-11-7-14(8-12-16)22-24(26,19-3)20-4/h5-12H,1-4H3
47 atoms
S  -0.138728 -3.010587 -1.123027
S  -6.544592 -0.551102 -0.047473
S  7.255448 1.430923 -0.267012
P  -5.543855 1.057546 0.201375
P  5.620783 0.750231 0.436752
O  -4.083712 0.910002 0.877376
O  5.21397 -0.684017 -0.176242
O  -6.180118 2.170161 1.149267
O  -5.183877 1.904135 -1.100961
O  5.559078 0.436962 2.001627
O  4.317536 1.667418 0.267303
C  -1.277083 -1.806183 -0.501473
C  1.420224 -2.231377 -0.815341
C  -3.169063 -0.003473 0.405239
C  3.937891 -1.158629 -0.35219
C  -1.265631 -0.491702 -0.958561
C  1.744906 -1.709808 0.433098
C  -2.242859 -2.206829 0.412753
C  2.370558 -2.211933 -1.828253
C  -2.20587 0.413779 -0.501524
C  2.994492 -1.164261 0.666957
C  -3.19987 -1.309139 0.861042
C  3.63041 -1.681449 -1.597608
C  -6.815018 1.811932 2.371314
C  -6.111526 2.018879 -2.174472
C  6.100085 1.358582 2.94239
C  4.040058 2.343988 -0.952654
H  -0.519914 -0.177104 -1.676507
H  1.015871 -1.730176 1.232399
H  -2.2485 -3.225455 0.777214
H  2.124981 -2.605673 -2.805824
H  -2.202172 1.437575 -0.850502
H  3.236196 -0.775783 1.646373
H  -3.960576 -1.620777 1.563116
H  4.37546 -1.671457 -2.382264
H  -6.082273 1.496593 3.115651
H  -7.540492 1.011262 2.220965
H  -7.326376 2.700575 2.732513
H  -6.465545 1.039267 -2.496462
H  -6.966913 2.633142 -1.890167
H  -5.583736 2.501884 -2.992681
H  7.112967 1.653296 2.665024
H  5.475988 2.249647 3.022622
H  6.1228 0.85031 3.902922
H  4.937199 2.815311 -1.356913
H  3.628225 1.656883 -1.693911
H  3.299804 3.108505 -0.729749
totalener: -2950.70873690 hartree
nucrepener: 3284.76735262 hartree
electener: -6235.47608952 hartree
twoeener: 4364.10267467 hartree
kineticenergy: 2942.64978037 hartree
xcener: -192.765929203801 hartree
chargesum: 0.0000000
charge: -0.028462 -0.393111 -0.367677 0.722864 0.679481 -0.338539 -0.301214 -0.309978 -0.319826 -0.309691 -0.307195 -0.009920 0.000391 0.244727 0.138098 -0.080083 -0.113239 -0.116014 -0.114170 -0.167761 -0.097076 -0.140864 -0.149712 -0.122281 -0.122684 -0.124986 -0.107600 0.122325 0.125530 0.119135 0.118433 0.126703 0.129376 0.122239 0.134158 0.113973 0.109539 0.117194 0.115102 0.114556 0.113572 0.113289 0.113864 0.116241 0.111263 0.105288 0.114742
qa: -0.0285 -0.3931 -0.3677 0.7229 0.6795 -0.3385 -0.3012 -0.3100 -0.3198 -0.3097 -0.3072 -0.0099 0.0004 0.2447 0.1381 -0.0801 -0.1132 -0.1160 -0.1142 -0.1678 -0.0971 -0.1409 -0.1497 -0.1223 -0.1227 -0.1250 -0.1076 0.1223 0.1255 0.1191 0.1184 0.1267 0.1294 0.1222 0.1342 0.1140 0.1095 0.1172 0.1151 0.1146 0.1136 0.1133 0.1139 0.1162 0.1113 0.1053 0.1147
va: 2.3306 2.0467 2.1000 5.5272 5.5302 2.1216 2.1469 2.1211 2.1280 2.1071 2.0706 3.8523 3.8467 3.8140 3.9095 3.9230 3.9744 3.9915 3.9664 4.0668 3.9230 4.0521 3.9887 3.8646 3.8719 3.8612 3.8653 1.0006 1.0005 1.0197 1.0190 1.0129 1.0229 1.0149 1.0088 0.9878 1.0056 0.9909 1.0025 0.9873 0.9915 1.0068 0.9876 0.9908 1.0113 0.9844 0.9912
dispcorr: -0.023391061 hartree
energy: -2950.732127962068
dipole: -7.43742 6.27721 -1.16020 10.80227 -9.46353 1.33874 3.02063 -2.48651 0.53412
magnitude: 1.85029 au
magnitude: 4.70307 debye
