program: Orca
programVersion: 5.0.2
elementType: S S S P P O O O O O O C C C C C C C C C C C C C C C C H H H H H H H H H H H H H H H H H H H H
charge: 0
multiplicity: 1
keywords: wb97x-d3
keywords: def2-TZVPP
keywords: def2/J RIJCOSX
keywords: DEFGRID2
keywords: scfconv7
keywords: smallprint printgap noloewdin
keywords: NOSOSCF
formula: C16H20O6P2S3
InChI: InChI=1/C16H20O6P2S3/c1-17-23(25,18-2)21-13-5-9-15(10-6-13)27-16-11-7-14(8-12-16)22-24(26,19-3)20-4/h5-12H,1-4H3
47 atoms
S  -0.432154 -2.802955 -1.024366
S  -4.582667 2.867125 0.799787
S  6.161663 -0.076916 -2.396963
P  -5.53993 1.248423 1.151334
P  5.738212 0.631881 -0.675798
O  -4.735413 0.050684 1.872948
O  4.722856 -0.219071 0.251761
O  -6.225107 0.559403 -0.123933
O  -6.736242 1.307991 2.197537
O  6.95004 0.814839 0.342692
O  5.041676 2.063196 -0.61499
C  -1.656238 -1.885577 -0.135438
C  1.076948 -1.97269 -0.631559
C  -3.714223 -0.57455 1.18929
C  3.521894 -0.765067 -0.10099
C  -1.407741 -0.701414 0.547587
C  1.594604 -1.018368 -1.49718
C  -2.949387 -2.405887 -0.148141
C  1.79726 -2.318564 0.507356
C  -2.436114 -0.044796 1.207175
C  2.811545 -0.406503 -1.238491
C  -3.977744 -1.752142 0.506853
C  3.013536 -1.717958 0.773723
C  -5.770199 0.766551 -1.457084
C  -7.710699 2.337677 2.086309
C  7.940951 -0.196266 0.493313
C  5.496631 3.136834 -1.431207
H  -0.413077 -0.278092 0.569392
H  1.042061 -0.74792 -2.386729
H  -3.157635 -3.331711 -0.670221
H  1.404041 -3.065269 1.18403
H  -2.242882 0.878931 1.735201
H  3.190421 0.329019 -1.933333
H  -4.978732 -2.162587 0.501537
H  3.576998 -1.986732 1.657056
H  -6.58263 0.469219 -2.11581
H  -4.894064 0.152881 -1.668513
H  -5.520771 1.81285 -1.634918
H  -8.326852 2.202783 1.195788
H  -8.34307 2.267294 2.96743
H  -7.244097 3.323248 2.052765
H  8.339663 -0.506814 -0.47331
H  8.738474 0.232981 1.094184
H  7.534734 -1.066796 1.010425
H  4.747044 3.920911 -1.363381
H  6.450783 3.522674 -1.07058
H  5.604704 2.825652 -2.471099
totalener: -2950.70972822 hartree
nucrepener: 3265.76070430 hartree
electener: -6216.47043252 hartree
twoeener: 4345.30188745 hartree
kineticenergy: 2942.63349383 hartree
xcener: -192.767517509416 hartree
chargesum: -0.0000000
charge: -0.032735 -0.401407 -0.378524 0.715004 0.694772 -0.317063 -0.299871 -0.326904 -0.303254 -0.315471 -0.307436 0.078753 -0.016085 0.182351 0.284536 -0.154655 -0.124575 -0.128723 -0.082295 -0.135062 -0.116322 -0.182009 -0.176402 -0.104686 -0.131503 -0.124521 -0.124181 0.122975 0.121842 0.108897 0.124717 0.130978 0.100063 0.132312 0.123508 0.115181 0.107800 0.112082 0.110710 0.117952 0.110762 0.111001 0.117297 0.113661 0.119644 0.117767 0.109122
qa: -0.0327 -0.4014 -0.3785 0.7150 0.6948 -0.3171 -0.2999 -0.3269 -0.3033 -0.3155 -0.3074 0.0788 -0.0161 0.1824 0.2845 -0.1547 -0.1246 -0.1287 -0.0823 -0.1351 -0.1163 -0.1820 -0.1764 -0.1047 -0.1315 -0.1245 -0.1242 0.1230 0.1218 0.1089 0.1247 0.1310 0.1001 0.1323 0.1235 0.1152 0.1078 0.1121 0.1107 0.1180 0.1108 0.1110 0.1173 0.1137 0.1196 0.1178 0.1091
va: 2.3634 2.0400 2.0556 5.5375 5.5450 2.1403 2.1914 2.0790 2.1472 2.1316 2.1042 3.9057 3.8923 3.8252 3.8301 3.9557 4.0417 3.9338 3.9757 4.0672 3.9452 4.0099 4.0087 3.8521 3.8737 3.8697 3.8567 1.0073 1.0164 1.0137 1.0093 1.0119 1.0432 1.0085 1.0124 0.9904 0.9826 1.0131 0.9881 0.9917 1.0038 1.0034 0.9904 0.9881 0.9897 0.9904 1.0059
dispcorr: -0.023295366 hartree
energy: -2950.733023586362
dipole: -1.14808 1.46135 0.31328 5.70539 -5.34602 0.35937 -1.98852 1.94445 -0.04407
magnitude: 0.47878 au
magnitude: 1.21696 debye
