program: Orca
programVersion: 5.0.2
elementType: S S S P P O O O O O O C C C C C C C C C C C C C C C C H H H H H H H H H H H H H H H H H H H H
charge: 0
multiplicity: 1
keywords: wb97x-d3
keywords: def2-TZVPP
keywords: def2/J RIJCOSX
keywords: DEFGRID2
keywords: scfconv7
keywords: smallprint printgap noloewdin
keywords: NOSOSCF
formula: C16H20O6P2S3
InChI: InChI=1/C16H20O6P2S3/c1-17-23(25,18-2)21-13-5-9-15(10-6-13)27-16-11-7-14(8-12-16)22-24(26,19-3)20-4/h5-12H,1-4H3
47 atoms
S  -0.020599 -3.02821 -0.64062
S  -4.382688 2.372101 0.97239
S  6.508371 2.598992 -1.207107
P  -5.579446 0.885455 0.858495
P  5.730373 0.985197 -0.558812
O  -5.013323 -0.550956 1.329869
O  4.159358 1.130897 -0.221104
O  -6.15523 0.522394 -0.583632
O  -6.910328 0.956064 1.734969
O  5.837996 -0.305671 -1.501279
O  6.280575 0.392503 0.818263
C  -1.475846 -2.198035 -0.070231
C  1.211409 -1.768822 -0.488935
C  -3.833047 -1.064921 0.841978
C  3.22322 0.131349 -0.302377
C  -1.457015 -1.308659 0.99961
C  1.080625 -0.545365 -1.139841
C  -2.685646 -2.508701 -0.681107
C  2.356876 -2.027542 0.252247
C  -2.631513 -0.729663 1.446598
C  2.078138 0.406178 -1.039169
C  -3.867773 -1.948906 -0.222249
C  3.370767 -1.084778 0.344105
C  -6.479009 1.537763 -1.526481
C  -6.887697 1.45723 3.065838
C  5.601147 -0.219714 -2.901801
C  7.678187 0.368151 1.088197
H  -0.522439 -1.059865 1.48446
H  0.192924 -0.334355 -1.721223
H  -2.706387 -3.185271 -1.525688
H  2.45654 -2.971124 0.772179
H  -2.617918 -0.029956 2.270887
H  1.977046 1.364728 -1.530785
H  -4.810829 -2.193807 -0.691983
H  4.250419 -1.295298 0.936044
H  -7.378825 2.07706 -1.22828
H  -6.662426 1.037316 -2.473944
H  -5.658224 2.246337 -1.641662
H  -7.923394 1.575923 3.374016
H  -6.394336 0.756068 3.740391
H  -6.380246 2.421471 3.117352
H  6.097971 0.650169 -3.333929
H  6.004764 -1.125433 -3.3474
H  4.53192 -0.167081 -3.113426
H  8.189696 -0.357754 0.454725
H  8.123228 1.352293 0.938252
H  7.791093 0.074997 2.128872
totalener: -2950.70908883 hartree
nucrepener: 3271.63532643 hartree
electener: -6222.34441526 hartree
twoeener: 4351.23965340 hartree
kineticenergy: 2942.63742619 hartree
xcener: -192.764943560890 hartree
chargesum: 0.0000000
charge: -0.024461 -0.397398 -0.367008 0.724508 0.680693 -0.337003 -0.303486 -0.319281 -0.310415 -0.306156 -0.310208 0.005349 -0.001184 0.238935 0.149653 -0.108690 -0.085261 -0.120150 -0.134142 -0.153237 -0.164032 -0.155478 -0.098141 -0.123172 -0.122281 -0.106671 -0.125931 0.131816 0.133846 0.113351 0.119881 0.121784 0.136885 0.126795 0.131520 0.114728 0.113775 0.113637 0.116275 0.114712 0.109366 0.110224 0.114806 0.106925 0.113950 0.114835 0.115532
qa: -0.0245 -0.3974 -0.3670 0.7245 0.6807 -0.3370 -0.3035 -0.3193 -0.3104 -0.3062 -0.3102 0.0053 -0.0012 0.2389 0.1497 -0.1087 -0.0853 -0.1202 -0.1341 -0.1532 -0.1640 -0.1555 -0.0981 -0.1232 -0.1223 -0.1067 -0.1259 0.1318 0.1338 0.1134 0.1199 0.1218 0.1369 0.1268 0.1315 0.1147 0.1138 0.1136 0.1163 0.1147 0.1094 0.1102 0.1148 0.1069 0.1140 0.1148 0.1155
va: 2.3589 2.0424 2.1001 5.5250 5.5308 2.1252 2.1452 2.1282 2.1198 2.0736 2.1081 3.8618 3.8425 3.8080 3.9179 3.9351 3.9205 3.9742 4.0231 4.0579 3.9725 4.0829 3.9478 3.8719 3.8661 3.8648 3.8642 0.9953 0.9979 1.0188 1.0204 1.0167 1.0088 1.0124 1.0214 0.9873 0.9910 1.0036 0.9911 0.9875 1.0049 1.0106 0.9917 0.9838 0.9872 1.0051 0.9909
dispcorr: -0.023350637 hartree
energy: -2950.732439470006
dipole: -1.91004 1.43147 -0.47856 -1.53784 0.70397 -0.83387 -1.56215 1.44323 -0.11892
magnitude: 0.96876 au
magnitude: 2.46240 debye
