program: Orca
programVersion: 5.0.2
elementType: S S S P P O O O O O O C C C C C C C C C C C C C C C C H H H H H H H H H H H H H H H H H H H H
charge: 0
multiplicity: 1
keywords: wb97x-d3
keywords: def2-TZVPP
keywords: def2/J RIJCOSX
keywords: DEFGRID2
keywords: scfconv7
keywords: smallprint printgap noloewdin
keywords: NOSOSCF
formula: C16H20O6P2S3
InChI: InChI=1/C16H20O6P2S3/c1-17-23(25,18-2)21-13-5-9-15(10-6-13)27-16-11-7-14(8-12-16)22-24(26,19-3)20-4/h5-12H,1-4H3
47 atoms
S  -0.041371 -3.884418 0.642483
S  -2.548003 2.590687 0.343214
S  3.848096 0.71981 -3.002527
P  -4.155744 1.621825 0.658978
P  4.221113 1.096786 -1.164123
O  -4.317898 0.156123 -0.006624
O  4.494243 -0.192432 -0.21459
O  -5.458727 2.337423 0.093144
O  -4.475592 1.258602 2.190878
O  5.524481 1.9525 -0.840023
O  3.110132 1.87175 -0.33188
C  -1.325124 -2.678923 0.425143
C  1.366419 -2.827772 0.428513
C  -3.327729 -0.7906 0.140865
C  3.470883 -1.085494 0.003286
C  -2.398338 -2.660544 1.306671
C  2.217996 -3.014145 -0.65161
C  -1.277966 -1.757954 -0.61766
C  1.600893 -1.785274 1.320406
C  -3.406952 -1.717823 1.164273
C  3.276926 -2.143421 -0.867794
C  -2.26915 -0.804882 -0.753534
C  2.644819 -0.9058 1.104474
C  -6.749604 1.734399 0.126613
C  -4.041661 2.099531 3.253193
C  6.734412 1.762762 -1.562833
C  1.996953 2.544871 -0.91326
H  -2.437068 -3.367483 2.125098
H  2.034952 -3.822968 -1.346247
H  -0.450027 -1.767035 -1.313832
H  0.944564 -1.645316 2.168974
H  -4.23776 -1.694059 1.856336
H  3.926928 -2.265626 -1.723089
H  -2.224205 -0.07323 -1.54841
H  2.819951 -0.080295 1.780757
H  -6.997213 1.355312 1.119199
H  -6.822305 0.921578 -0.595444
H  -7.462038 2.511049 -0.140498
H  -4.274024 1.578267 4.178634
H  -2.968877 2.28251 3.196262
H  -4.563725 3.057578 3.243367
H  7.375677 2.60829 -1.326954
H  7.232163 0.841372 -1.258249
H  6.553457 1.734462 -2.638222
H  1.690752 2.077714 -1.848983
H  1.17929 2.488087 -0.198459
H  2.245252 3.589362 -1.099148
totalener: -2950.70757429 hartree
nucrepener: 3431.82730951 hartree
electener: -6382.53488380 hartree
twoeener: 4511.74574415 hartree
kineticenergy: 2942.64946947 hartree
xcener: -192.765818196098 hartree
chargesum: 0.0000000
charge: -0.042708 -0.379504 -0.402557 0.716388 0.723049 -0.348077 -0.333489 -0.302280 -0.329850 -0.310374 -0.321586 0.006435 -0.004625 0.249391 0.260327 -0.118170 -0.128583 -0.090664 -0.060185 -0.158353 -0.151364 -0.169273 -0.184776 -0.128762 -0.119099 -0.122923 -0.094441 0.114062 0.121849 0.128500 0.120073 0.120949 0.125757 0.127394 0.127359 0.107741 0.115388 0.119172 0.113327 0.114679 0.114949 0.116197 0.115638 0.108731 0.107399 0.111450 0.115437
qa: -0.0427 -0.3795 -0.4026 0.7164 0.7230 -0.3481 -0.3335 -0.3023 -0.3298 -0.3104 -0.3216 0.0064 -0.0046 0.2494 0.2603 -0.1182 -0.1286 -0.0907 -0.0602 -0.1584 -0.1514 -0.1693 -0.1848 -0.1288 -0.1191 -0.1229 -0.0944 0.1141 0.1218 0.1285 0.1201 0.1209 0.1258 0.1274 0.1274 0.1077 0.1154 0.1192 0.1133 0.1147 0.1149 0.1162 0.1156 0.1087 0.1074 0.1115 0.1154
va: 2.3004 2.0797 2.0371 5.5123 5.5233 2.0972 2.1175 2.1325 2.0635 2.1343 2.1196 3.8576 3.8235 3.7824 3.8028 3.9815 3.9813 3.9141 3.9158 4.0817 4.0552 4.0673 4.0406 3.8845 3.8700 3.8661 3.8465 1.0195 1.0178 0.9976 1.0042 1.0142 1.0163 1.0138 1.0129 0.9931 0.9903 0.9895 0.9916 1.0060 0.9873 0.9904 0.9868 1.0060 1.0110 0.9944 0.9893
dispcorr: -0.024833710 hartree
energy: -2950.732407998265
dipole: -6.15004 5.17301 -0.97703 6.44763 -6.06771 0.37992 5.39402 -4.35029 1.04373
magnitude: 1.47929 au
magnitude: 3.76005 debye
